{"text_format":"3","workbook":"xlsx","n_sheets":13,"sheets":["Luchtverhitter","cal","NL","EN","DE","FR","NR","SP","SW","TS","ExtraTaal1","ExtraTaal2","ExtraTaal3"],"not_rendered":{"images":5,"macros":1,"defined_names":10,"comments":1},"read":"whole","date_system":"1900"}

{"sheet":"Luchtverhitter","index":0,"n_rows":28,"n_cols":14,"rows_kept":28,"merged":[[0,14,1,15],[1,1,1,2],[1,6,1,9],[1,10,1,11],[2,1,2,2],[2,14,2,15],[3,6,3,9],[3,10,3,12],[3,14,3,15],[7,1,7,3],[7,6,7,9],[7,12,7,13],[8,1,8,3],[8,6,8,9],[8,12,11,13],[9,1,9,3],[9,6,9,9],[10,6,10,9],[14,1,14,15],[20,1,20,15]]}
[]
[null,"Selectiontool",{"$nulls":4},"Taal/Language/Sprache/Språk/Jazyk",0,0,0,"Nederlands"]
[null,{"$f":"HLOOKUP(K2,cal!E1:M2,2,FALSE)","v":"luchtverhitter"}]
[{"$nulls":6},{"$f":"IF(cal!$S$7=1,\"Uitvoering\",IF(cal!$S$7=2,\"Version\",IF(cal!$S$7=3,\"Ausführung\",IF(cal!$S$7=4,\"Version\",IF(cal!$S$7=5,\"Modell\",IF(cal!$S$7=6,\"Montaje\",IF(cal!$S$7=7,\"Version\",IF(cal!$S$7=8,\"Verze\",IF(cal!$S$7=9,\"ExtraTaal1\",IF(cal!$S$7=10,\"ExtraTaal2\",IF(cal!$S$7=11,\"ExtraTaal3\",)))))))))))","v":"Uitvoering"},{"$nulls":3},"021/031"]
[]
[null,{"$f":"cal!B7","v":"Temperaturen"}]
[null,{"$f":"cal!B8","v":"Verwarmen:"},{"$nulls":4},{"$f":"cal!G8","v":"Koelen:"}]
[null,{"$f":"cal!B9","v":"Water aanvoer"},{"$f":"cal!C9","v":0},{"$f":"cal!D9","v":0},55,{"$f":"cal!F9","v":"°C"},{"$f":"cal!G9","v":"Water aanvoer"},{"$f":"cal!H9","v":0},{"$f":"cal!I9","v":0},{"$f":"cal!J9","v":0},16,{"$f":"cal!L9","v":"°C"},{"$f":"cal!M9","v":"Eenheidsstelsel"}]
[null,{"$f":"cal!B10","v":"Water retour"},{"$f":"cal!C10","v":0},{"$f":"cal!D10","v":0},45,{"$f":"cal!F10","v":"°C"},{"$f":"cal!G10","v":"Water retour"},{"$f":"cal!H10","v":0},{"$f":"cal!I10","v":0},{"$f":"cal!J10","v":0},{"v":18.22222222222222,"d":"18"},{"$f":"cal!L10","v":"°C"}]
[null,{"$f":"cal!B11","v":"Ruimte"},{"$f":"cal!C11","v":0},{"$f":"cal!D11","v":0},20,{"$f":"cal!F11","v":"°C"},{"$f":"cal!G11","v":"Ruimte"},{"$f":"cal!H11","v":0},{"$f":"cal!I11","v":0},{"$f":"cal!J11","v":0},27,{"$f":"cal!L11","v":"°C"}]
[{"$nulls":6},{"$f":"cal!G12","v":"Relatieve vochtigheid"},{"$f":"cal!H12","v":0},{"$f":"cal!I12","v":0},{"$f":"cal!J12","v":0},{"v":0.5,"d":"50%"}]
[]
[{"$nulls":3},{"$f":"cal!D14","v":{"v":1,"d":"1.0000"}},{"$f":"cal!E14","v":{"v":1,"d":"1.0000"}},{"$f":"cal!F14","v":{"v":1,"d":"1.0000"}},{"$f":"cal!G14","v":{"v":1,"d":"1.0000"}},{"$f":"cal!H14","v":{"v":1,"d":"1.0000"}},{"$f":"cal!I14","v":{"v":1,"d":"1.0000"}},{"$f":"cal!J14","v":{"v":1,"d":"1.0000"}},{"$f":"cal!K14","v":0.000334444444444444},{"$f":"cal!L14","v":0},{"$f":"cal!M14","v":1},{"$f":"cal!N14","v":{"v":1,"d":"1.0000"}}]
[null,{"$f":"cal!B15","v":"Snelheidsniveau"},{"$f":"cal!C15","v":"Stuurspanning [V]"},{"$f":"cal!D15","v":"Warmteafgifte  55/45/20 [kW]"},{"$f":"cal!O15","v":"Uitblaastemp. verwarming  [°C]"},{"$f":"cal!G15","v":"Voelb. Koelcapaciteit  16/18/27 [kW]"},{"$f":"cal!P15","v":"Uitblaastemp. koeling  [°C]"},{"$f":"cal!K15","v":"Geluidsdruk ** [dB(A)]"},{"$f":"cal!L15","v":"Geluidsvermogen * [dB(A)]"},{"$f":"cal!I15","v":"Toerental [u/min]"},{"$f":"cal!M15","v":"Opgenomen elektr. vermogen [W]"},{"$f":"cal!N15","v":"Luchtdebiet [m³/h]"}]
[null,{"$f":"cal!B16","v":"Luchtverhitter hoogte 41 cm breedte 41 cm lengte 43 cm (Type 021)"}]
[null,{"$f":"cal!B17","v":{"v":0.2,"d":"20%"}},{"$f":"cal!C17","v":2},{"$f":"IF($E$8<=$E$9,cal!$Z$3,cal!D17)","v":{"v":2.676923076923077,"d":"2.7"}},{"$f":"IF($E$8<=$E$9,\"\",cal!O17)","v":{"v":33.39453001573305,"d":"33.4"}},{"$f":"IF($K$8>=$K$9,cal!$Z$3,cal!G17)","v":{"v":0.8823931623931625,"d":"0.9"}},{"$f":"IF($K$8>=$K$9,\"\",cal!P17)","v":{"v":22.584766031850958,"d":"22.6"}},{"$f":"cal!K17","v":{"v":34,"d":"34.0"}},{"$f":"cal!L17","v":{"v":50,"d":"50.0"}},{"$f":"cal!I17","v":731},{"$f":"cal!M17","v":{"v":10,"d":"10.0"}},{"$f":"cal!N17","v":594}]
[null,{"$f":"cal!B18","v":{"v":0.4,"d":"40%"}},{"$f":"cal!C18","v":4},{"$f":"IF($E$8<=$E$9,cal!$Z$4,cal!D18)","v":{"v":3.276923076923077,"d":"3.3"}},{"$f":"IF($E$8<=$E$9,\"\",cal!O18)","v":{"v":31.499021065902486,"d":"31.5"}},{"$f":"IF($K$8>=$K$9,cal!$Z$5,cal!G18)","v":{"v":1.0801709401709403,"d":"1.1"}},{"$f":"IF($K$8>=$K$9,\"\",cal!P18)","v":{"v":23.209581944943253,"d":"23.2"}},{"$f":"cal!K18","v":42.4},{"$f":"cal!L18","v":58.4},{"$f":"cal!I18","v":984},{"$f":"cal!M18","v":{"v":20,"d":"20.0"}},{"$f":"cal!N18","v":847}]
[null,{"$f":"cal!B19","v":{"v":0.6,"d":"60%"}},{"$f":"cal!C19","v":6},{"$f":"IF($E$8<=$E$9,\"\",cal!D19)","v":{"v":3.8307692307692314,"d":"3.8"}},{"$f":"IF($E$8<=$E$9,\"\",cal!O19)","v":{"v":29.952633211292362,"d":"30.0"}},{"$f":"IF($K$8>=$K$9,\"\",cal!G19)","v":{"v":1.262735042735043,"d":"1.3"}},{"$f":"IF($K$8>=$K$9,\"\",cal!P19)","v":{"v":23.71931720072215,"d":"23.7"}},{"$f":"cal!K19","v":{"v":50.099999999999994,"d":"50.1"}},{"$f":"cal!L19","v":66.1},{"$f":"cal!I19","v":1286},{"$f":"cal!M19","v":{"v":43,"d":"43.0"}},{"$f":"cal!N19","v":1144}]
[null,{"$f":"cal!B20","v":{"v":0.8,"d":"80%"}},{"$f":"cal!C20","v":8},{"$f":"IF($E$8<=$E$9,\"\",cal!D20)","v":{"v":4.246153846153846,"d":"4.2"}},{"$f":"IF($E$8<=$E$9,\"\",cal!O20)","v":{"v":29.52484419388132,"d":"29.5"}},{"$f":"IF($K$8>=$K$9,\"\",cal!G20)","v":{"v":1.3996581196581197,"d":"1.4"}},{"$f":"IF($K$8>=$K$9,\"\",cal!P20)","v":{"v":23.86032913609097,"d":"23.9"}},{"$f":"cal!K20","v":{"v":53.900000000000006,"d":"53.9"}},{"$f":"cal!L20","v":69.9},{"$f":"cal!I20","v":1469},{"$f":"cal!M20","v":{"v":63,"d":"63.0"}},{"$f":"cal!N20","v":1325}]
[null,{"$f":"cal!B21","v":{"v":1,"d":"100%"}},{"$f":"cal!C21","v":10},{"$f":"IF($E$8<=$E$9,\"\",cal!D21)","v":{"v":4.384615384615385,"d":"4.4"}},{"$f":"IF($E$8<=$E$9,\"\",cal!O21)","v":{"v":29.16452457427392,"d":"29.2"}},{"$f":"IF($K$8>=$K$9,\"\",cal!G21)","v":{"v":1.4452991452991455,"d":"1.4"}},{"$f":"IF($K$8>=$K$9,\"\",cal!P21)","v":{"v":23.979101158850447,"d":"24.0"}},{"$f":"cal!K21","v":{"v":55.400000000000006,"d":"55.4"}},{"$f":"cal!L21","v":71.4},{"$f":"cal!I21","v":1559},{"$f":"cal!M21","v":{"v":76,"d":"76.0"}},{"$f":"cal!N21","v":1422}]
[null,{"$f":"cal!B22","v":"Luchtverhitter hoogte 41 cm breedte 41 cm lengte 43 cm (Type 031)"}]
[null,{"$f":"cal!B23","v":{"v":0.2,"d":"20%"}},{"$f":"cal!C23","v":2},{"$f":"IF($E$8<=$E$9,cal!$Z$3,cal!D23)","v":{"v":3.184615384615385,"d":"3.2"}},{"$f":"IF($E$8<=$E$9,\"\",cal!O23)","v":{"v":36.87221732204914,"d":"36.9"}},{"$f":"IF($K$8>=$K$9,cal!$Z$3,cal!G23)","v":{"v":1.0497435897435898,"d":"1.0"}},{"$f":"IF($K$8>=$K$9,\"\",cal!P23)","v":{"v":21.438417253102322,"d":"21.4"}},{"$f":"cal!K23","v":{"v":33,"d":"33.0"}},{"$f":"cal!L23","v":{"v":49,"d":"49.0"}},{"$f":"cal!I23","v":731},{"$f":"cal!M23","v":{"v":11,"d":"11.0"}},{"$f":"cal!N23","v":561}]
[null,{"$f":"cal!B24","v":{"v":0.4,"d":"40%"}},{"$f":"cal!C24","v":4},{"$f":"IF($E$8<=$E$9,cal!$Z$4,cal!D24)","v":{"v":3.9230769230769234,"d":"3.9"}},{"$f":"IF($E$8<=$E$9,\"\",cal!O24)","v":{"v":34.593453465417156,"d":"34.6"}},{"$f":"IF($K$8>=$K$9,cal!$Z$5,cal!G24)","v":{"v":1.2931623931623932,"d":"1.3"}},{"$f":"IF($K$8>=$K$9,\"\",cal!P24)","v":{"v":22.189565339177307,"d":"22.2"}},{"$f":"cal!K24","v":41.4},{"$f":"cal!L24","v":57.4},{"$f":"cal!I24","v":984},{"$f":"cal!M24","v":{"v":21,"d":"21.0"}},{"$f":"cal!N24","v":799}]
[null,{"$f":"cal!B25","v":{"v":0.6,"d":"60%"}},{"$f":"cal!C25","v":6},{"$f":"IF($E$8<=$E$9,\"\",cal!D25)","v":{"v":4.846153846153847,"d":"4.8"}},{"$f":"IF($E$8<=$E$9,\"\",cal!O25)","v":{"v":33.33679497256179,"d":"33.3"}},{"$f":"IF($K$8>=$K$9,\"\",cal!G25)","v":{"v":1.5974358974358975,"d":"1.6"}},{"$f":"IF($K$8>=$K$9,\"\",cal!P25)","v":{"v":22.60379721274815,"d":"22.6"}},{"$f":"cal!K25","v":{"v":49,"d":"49.0"}},{"$f":"cal!L25","v":{"v":65,"d":"65.0"}},{"$f":"cal!I25","v":1286},{"$f":"cal!M25","v":{"v":45,"d":"45.0"}},{"$f":"cal!N25","v":1080}]
[null,{"$f":"cal!B26","v":{"v":0.8,"d":"80%"}},{"$f":"cal!C26","v":8},{"$f":"IF($E$8<=$E$9,\"\",cal!D26)","v":5.4},{"$f":"IF($E$8<=$E$9,\"\",cal!O26)","v":{"v":32.82964038470486,"d":"32.8"}},{"$f":"IF($K$8>=$K$9,\"\",cal!G26)","v":{"v":1.78,"d":"1.8"}},{"$f":"IF($K$8>=$K$9,\"\",cal!P26)","v":{"v":22.770970391708396,"d":"22.8"}},{"$f":"cal!K26","v":{"v":52,"d":"52.0"}},{"$f":"cal!L26","v":{"v":68,"d":"68.0"}},{"$f":"cal!I26","v":1469},{"$f":"cal!M26","v":{"v":65,"d":"65.0"}},{"$f":"cal!N26","v":1251}]
[null,{"$f":"cal!B27","v":{"v":1,"d":"100%"}},{"$f":"cal!C27","v":10},{"$f":"IF($E$8<=$E$9,\"\",cal!D27)","v":{"v":5.769230769230769,"d":"5.8"}},{"$f":"IF($E$8<=$E$9,\"\",cal!O27)","v":{"v":32.777427587082826,"d":"32.8"}},{"$f":"IF($K$8>=$K$9,\"\",cal!G27)","v":{"v":1.9017094017094018,"d":"1.9"}},{"$f":"IF($K$8>=$K$9,\"\",cal!P27)","v":{"v":22.788181276850477,"d":"22.8"}},{"$f":"cal!K27","v":{"v":53.099999999999994,"d":"53.1"}},{"$f":"cal!L27","v":69.1},{"$f":"cal!I27","v":1559},{"$f":"cal!M27","v":{"v":79,"d":"79.0"}},{"$f":"cal!N27","v":1342}]
[null,{"$f":"cal!B46","v":"*Geluidsvermogen gemeten volgens ISO 3741:2010"},{"$nulls":11},"v2025-07-25"]
[null,{"$f":"cal!B47","v":"**Geluidsdruk bij een aangenomen ruimtedemping van 16 dB(A)"}]

{"sheet":"cal","index":1,"n_rows":47,"n_cols":94,"rows_kept":47,"hidden":true,"merged":[[2,6,2,9],[4,6,4,9],[6,12,6,13],[7,12,7,13],[8,1,8,3],[8,6,8,9],[8,12,8,13],[9,1,9,3],[9,6,9,9],[10,1,10,3],[10,6,10,9],[15,1,15,15],[15,22,15,28],[15,30,15,36],[15,37,15,43],[15,44,15,50],[15,51,15,57],[15,58,15,64],[15,65,15,71],[15,72,15,78],[15,79,15,85],[15,86,15,92],[15,93,15,99],[27,1,27,15],[33,1,33,15],[39,1,39,15]]}
[{"$nulls":4},"Nederlands","English","Deutsch","Français","Norsk","Español","Svenska","Čeština","ExtraTaal1","ExtraTaal2","ExtraTaal3",{"$nulls":8},"Luchtverhitter",{"$nulls":14},{"$f":"Tv_cool","v":16},{"$nulls":3},{"$f":"W12","v":{"v":0.5,"d":"50%"}}]
[{"$nulls":4},"luchtverhitter","unit heater","Lufterhitzer","aérotherme","vifteovn","calentador","fläktvärmare","ohřívač ventilátoru",{"$nulls":11},"021/031",{"$nulls":14},{"$f":"Tr_cool","v":18.22222222222222}]
[null,{"$f":"IF($S$7=1,NL!B3,IF(cal!$S$7=2,EN!B3,IF(cal!$S$7=3,DE!B3,IF(cal!$S$7=4,FR!B3,IF(cal!$S$7=5,NR!B3,IF(cal!$S$7=6,SP!B3,IF(cal!$S$7=7,SW!B3,IF(cal!$S$7=8,TS!B3,IF(cal!$S$7=9,ExtraTaal1!B3,IF(cal!$S$7=10,ExtraTaal2!B3,IF(cal!$S$7=11,ExtraTaal3!B3,)))))))))))","v":"Invulformulier"},{"$nulls":21},"121/131",null,{"$f":"IF($S$7=1,NL!R16,IF(cal!$S$7=2,EN!R16,IF(cal!$S$7=3,DE!R16,IF(cal!$S$7=4,FR!R16,IF(cal!$S$7=5,NR!R16,IF(cal!$S$7=6,SP!R16,IF(cal!$S$7=7,SW!R16,IF(cal!$S$7=8,TS!R16,IF(cal!$S$7=9,ExtraTaal1!R16,IF(cal!$S$7=10,ExtraTaal2!R16,IF(cal!$S$7=11,ExtraTaal3!R16,)))))))))))","v":"Temp."},{"$f":"IF($S$7=1,NL!Q7,IF(cal!$S$7=2,EN!Q7,IF(cal!$S$7=3,DE!Q7,IF(cal!$S$7=4,FR!Q7,IF(cal!$S$7=5,NR!Q7,IF(cal!$S$7=6,SP!Q7,IF(cal!$S$7=7,SW!Q7,IF(cal!$S$7=8,TS!Q7,IF(cal!$S$7=9,ExtraTaal1!Q7,IF(cal!$S$7=10,ExtraTaal2!Q7,IF(cal!$S$7=11,ExtraTaal3!Q7,)))))))))))","v":"Kopieer alle data"},{"$nulls":11},{"$f":"Tl_cool","v":27}]
[{"$nulls":22},1,"221/231",null,{"$f":"IF($S$7=1,NL!R17,IF(cal!$S$7=2,EN!R17,IF(cal!$S$7=3,DE!R17,IF(cal!$S$7=4,FR!R17,IF(cal!$S$7=5,NR!R17,IF(cal!$S$7=6,SP!R17,IF(cal!$S$7=7,SW!R17,IF(cal!$S$7=8,TS!R17,IF(cal!$S$7=9,ExtraTaal1!R17,IF(cal!$S$7=10,ExtraTaal2!R17,IF(cal!$S$7=11,ExtraTaal3!R17,)))))))))))","v":"verw.!"},{"$f":"IF($S$7=1,NL!Q8,IF(cal!$S$7=2,EN!Q8,IF(cal!$S$7=3,DE!Q8,IF(cal!$S$7=4,FR!Q8,IF(cal!$S$7=5,NR!Q8,IF(cal!$S$7=6,SP!Q8,IF(cal!$S$7=7,SW!Q8,IF(cal!$S$7=8,TS!Q8,IF(cal!$S$7=9,ExtraTaal1!Q8,IF(cal!$S$7=10,ExtraTaal2!Q8,IF(cal!$S$7=11,ExtraTaal3!Q8,)))))))))))","v":"SI-eenheden"}]
[null,{"$f":"IF($S$7=1,NL!B5,IF(cal!$S$7=2,EN!B5,IF(cal!$S$7=3,DE!B5,IF(cal!$S$7=4,FR!B5,IF(cal!$S$7=5,NR!B5,IF(cal!$S$7=6,SP!B5,IF(cal!$S$7=7,SW!B5,IF(cal!$S$7=8,TS!B5,IF(cal!$S$7=9,ExtraTaal1!B5,IF(cal!$S$7=10,ExtraTaal2!B5,IF(cal!$S$7=11,ExtraTaal3!B5,)))))))))))","v":"Randvoorwaarden"},{"$nulls":21},"321/331",null,{"$f":"IF($S$7=1,NL!R18,IF(cal!$S$7=2,EN!R18,IF(cal!$S$7=3,DE!R18,IF(cal!$S$7=4,FR!R18,IF(cal!$S$7=5,NR!R18,IF(cal!$S$7=6,SP!R18,IF(cal!$S$7=7,SW!R18,IF(cal!$S$7=8,TS!R18,IF(cal!$S$7=9,ExtraTaal1!R18,IF(cal!$S$7=10,ExtraTaal2!R18,IF(cal!$S$7=11,ExtraTaal3!R18,)))))))))))","v":"koelen!"},{"$f":"IF($S$7=1,NL!Q9,IF(cal!$S$7=2,EN!Q9,IF(cal!$S$7=3,DE!Q9,IF(cal!$S$7=4,FR!Q9,IF(cal!$S$7=5,NR!Q9,IF(cal!$S$7=6,SP!Q9,IF(cal!$S$7=7,SW!Q9,IF(cal!$S$7=8,TS!Q9,IF(cal!$S$7=9,ExtraTaal1!Q9,IF(cal!$S$7=10,ExtraTaal2!Q9,IF(cal!$S$7=11,ExtraTaal3!Q9,)))))))))))","v":"Imperiale-eenheden"}]
[{"$nulls":23},"421/431"]
[null,{"$f":"IF($S$7=1,NL!B7,IF(cal!$S$7=2,EN!B7,IF(cal!$S$7=3,DE!B7,IF(cal!$S$7=4,FR!B7,IF(cal!$S$7=5,NR!B7,IF(cal!$S$7=6,SP!B7,IF(cal!$S$7=7,SW!B7,IF(cal!$S$7=8,TS!B7,IF(cal!$S$7=9,ExtraTaal1!B7,IF(cal!$S$7=10,ExtraTaal2!B7,IF(cal!$S$7=11,ExtraTaal3!B7,)))))))))))","v":"Temperaturen"},{"$nulls":10},{"$f":"IF($S$7=8,\"Výška umístění\",\"h_atm\")","v":"h_atm"},{"$nulls":5},{"$f":"IF(Luchtverhitter!$K$2=cal!$E$1,1,IF(Luchtverhitter!$K$2=cal!$F$1,2,IF(Luchtverhitter!$K$2=cal!G1,3,IF(Luchtverhitter!$K$2=cal!H1,4,IF(Luchtverhitter!$K$2=cal!I1,5,IF(Luchtverhitter!$K$2=cal!J1,6,IF(Luchtverhitter!$K$2=cal!K1,7,IF(Luchtverhitter!$K$2=cal!L1,8,IF(Luchtverhitter!$K$2=cal!M1,9,IF(Luchtverhitter!$K$2=cal!N1,10,IF(Luchtverhitter!$K$2=cal!O1,11,)))))))))))","v":1}]
[null,{"$f":"IF($S$7=1,NL!B8,IF(cal!$S$7=2,EN!B8,IF(cal!$S$7=3,DE!B8,IF(cal!$S$7=4,FR!B8,IF(cal!$S$7=5,NR!B8,IF(cal!$S$7=6,SP!B8,IF(cal!$S$7=7,SW!B8,IF(cal!$S$7=8,TS!B8,IF(cal!$S$7=9,ExtraTaal1!B8,IF(cal!$S$7=10,ExtraTaal2!B8,IF(cal!$S$7=11,ExtraTaal3!B8,)))))))))))","v":"Verwarmen:"},{"$nulls":4},{"$f":"IF($S$7=1,NL!G8,IF(cal!$S$7=2,EN!G8,IF(cal!$S$7=3,DE!G8,IF(cal!$S$7=4,FR!G8,IF(cal!$S$7=5,NR!G8,IF(cal!$S$7=6,SP!G8,IF(cal!$S$7=7,SW!G8,IF(cal!$S$7=8,TS!G8,IF(cal!$S$7=9,ExtraTaal1!G8,IF(cal!$S$7=10,ExtraTaal2!G8,IF(cal!$S$7=11,ExtraTaal3!G8,)))))))))))","v":"Koelen:"},{"$nulls":5},{"$f":"Luchtverhitter!M7","v":{"v":0,"d":"0.00"}},{"$f":"Luchtverhitter!N7","v":{"v":0,"d":"0.00"}},{"$nulls":4},"Temp",{"$nulls":3},"Temp"]
[null,{"$f":"IF($S$7=1,NL!B9,IF(cal!$S$7=2,EN!B9,IF(cal!$S$7=3,DE!B9,IF(cal!$S$7=4,FR!B9,IF(cal!$S$7=5,NR!B9,IF(cal!$S$7=6,SP!B9,IF(cal!$S$7=7,SW!B9,IF(cal!$S$7=8,TS!B9,IF(cal!$S$7=9,ExtraTaal1!B9,IF(cal!$S$7=10,ExtraTaal2!B9,IF(cal!$S$7=11,ExtraTaal3!B9,)))))))))))","v":"Water aanvoer"},{"$f":"IF($S$7=1,NL!C9,IF(cal!$S$7=2,EN!C9,IF(cal!$S$7=3,DE!C9,IF(cal!$S$7=4,FR!C9,IF(cal!$S$7=5,NR!C9,IF(cal!$S$7=6,SP!C9,IF(cal!$S$7=7,SW!C9,IF(cal!$S$7=8,TS!C9,IF(cal!$S$7=9,ExtraTaal1!C9,IF(cal!$S$7=10,ExtraTaal2!C9,IF(cal!$S$7=11,ExtraTaal3!C9,)))))))))))","v":0},{"$f":"IF($S$7=1,NL!D9,IF(cal!$S$7=2,EN!D9,IF(cal!$S$7=3,DE!D9,IF(cal!$S$7=4,FR!D9,IF(cal!$S$7=5,NR!D9,IF(cal!$S$7=6,SP!D9,IF(cal!$S$7=7,SW!D9,IF(cal!$S$7=8,TS!D9,IF(cal!$S$7=9,ExtraTaal1!D9,IF(cal!$S$7=10,ExtraTaal2!D9,IF(cal!$S$7=11,ExtraTaal3!D9,)))))))))))","v":0},{"$f":"Luchtverhitter!E8","v":55},{"$f":"IF($W$4=1,\"°C\",IF($W$4=2,\"°F\",))","v":"°C"},{"$f":"B9","v":"Water aanvoer"},{"$f":"IF($S$7=1,NL!H9,IF(cal!$S$7=2,EN!H9,IF(cal!$S$7=3,DE!H9,IF(cal!$S$7=4,FR!H9,))))","v":0},{"$f":"IF($S$7=1,NL!I9,IF(cal!$S$7=2,EN!I9,IF(cal!$S$7=3,DE!I9,IF(cal!$S$7=4,FR!I9,))))","v":0},{"$f":"IF($S$7=1,NL!J9,IF(cal!$S$7=2,EN!J9,IF(cal!$S$7=3,DE!J9,IF(cal!$S$7=4,FR!J9,))))","v":0},{"$f":"Luchtverhitter!K8","v":16},{"$f":"F9","v":"°C"},{"$f":"IF($S$7=1,NL!M9,IF(cal!$S$7=2,EN!M9,IF(cal!$S$7=3,DE!M9,IF(cal!$S$7=4,FR!M9,IF(cal!$S$7=5,NR!M9,IF(cal!$S$7=6,SP!M9,))))))","v":"Eenheidsstelsel"},{"$f":"IF($S$7=1,NL!N9,IF(cal!$S$7=2,EN!N9,IF(cal!$S$7=3,DE!N9,IF(cal!$S$7=4,FR!N9,IF(cal!$S$7=5,#REF!,)))))","v":0},{"$nulls":4},{"$f":"IF($W$4=1,E9,IF($W$4=2,(E9-32)/1.8))","v":{"v":55,"d":"55.0"}},{"$nulls":3},{"$f":"IF($W$4=1,K9,IF($W$4=2,(K9-32)/1.8))","v":{"v":16,"d":"16.0"}}]
[null,{"$f":"IF($S$7=1,NL!B10,IF(cal!$S$7=2,EN!B10,IF(cal!$S$7=3,DE!B10,IF(cal!$S$7=4,FR!B10,IF(cal!$S$7=5,NR!B10,IF(cal!$S$7=6,SP!B10,IF(cal!$S$7=7,SW!B10,IF(cal!$S$7=8,TS!B10,IF(cal!$S$7=9,ExtraTaal1!B10,IF(cal!$S$7=10,ExtraTaal2!B10,IF(cal!$S$7=11,ExtraTaal3!B10,)))))))))))","v":"Water retour"},{"$f":"IF($S$7=1,NL!C10,IF(cal!$S$7=2,EN!C10,IF(cal!$S$7=3,DE!C10,IF(cal!$S$7=4,FR!C10,IF(cal!$S$7=5,NR!C10,IF(cal!$S$7=6,SP!C10,IF(cal!$S$7=7,SW!C10,IF(cal!$S$7=8,TS!C10,IF(cal!$S$7=9,ExtraTaal1!C10,IF(cal!$S$7=10,ExtraTaal2!C10,IF(cal!$S$7=11,ExtraTaal3!C10,)))))))))))","v":0},{"$f":"IF($S$7=1,NL!D10,IF(cal!$S$7=2,EN!D10,IF(cal!$S$7=3,DE!D10,IF(cal!$S$7=4,FR!D10,IF(cal!$S$7=5,NR!D10,IF(cal!$S$7=6,SP!D10,IF(cal!$S$7=7,SW!D10,IF(cal!$S$7=8,TS!D10,IF(cal!$S$7=9,ExtraTaal1!D10,IF(cal!$S$7=10,ExtraTaal2!D10,IF(cal!$S$7=11,ExtraTaal3!D10,)))))))))))","v":0},{"$f":"Luchtverhitter!E9","v":45},{"$f":"F9","v":"°C"},{"$f":"B10","v":"Water retour"},{"$f":"IF($S$7=1,NL!H10,IF(cal!$S$7=2,EN!H10,IF(cal!$S$7=3,DE!H10,IF(cal!$S$7=4,FR!H10,))))","v":0},{"$f":"IF($S$7=1,NL!I10,IF(cal!$S$7=2,EN!I10,IF(cal!$S$7=3,DE!I10,IF(cal!$S$7=4,FR!I10,))))","v":0},{"$f":"IF($S$7=1,NL!J10,IF(cal!$S$7=2,EN!J10,IF(cal!$S$7=3,DE!J10,IF(cal!$S$7=4,FR!J10,))))","v":0},{"$f":"Luchtverhitter!K9","v":{"v":18.22222222222222,"d":"18"}},{"$f":"F9","v":"°C"},{"$nulls":6},{"$f":"IF($W$4=1,E10,IF($W$4=2,(E10-32)/1.8))","v":{"v":45,"d":"45.0"}},{"$nulls":3},{"$f":"IF($W$4=1,K10,IF($W$4=2,(K10-32)/1.8))","v":{"v":18.22222222222222,"d":"18.2"}},null,"p_atm","h[mm]","cf_h","dt og","dt nieuw heating","dt koeling",{"$nulls":4},"checking for condensation cooling"]
[null,{"$f":"IF($S$7=1,NL!B11,IF(cal!$S$7=2,EN!B11,IF(cal!$S$7=3,DE!B11,IF(cal!$S$7=4,FR!B11,IF(cal!$S$7=5,NR!B11,IF(cal!$S$7=6,SP!B11,IF(cal!$S$7=7,SW!B11,IF(cal!$S$7=8,TS!B11,IF(cal!$S$7=9,ExtraTaal1!B11,IF(cal!$S$7=10,ExtraTaal2!B11,IF(cal!$S$7=11,ExtraTaal3!B11,)))))))))))","v":"Ruimte"},{"$f":"IF($S$7=1,NL!C11,IF(cal!$S$7=2,EN!C11,IF(cal!$S$7=3,DE!C11,IF(cal!$S$7=4,FR!C11,IF(cal!$S$7=5,NR!C11,IF(cal!$S$7=6,SP!C11,IF(cal!$S$7=7,SW!C11,IF(cal!$S$7=8,TS!C11,IF(cal!$S$7=9,ExtraTaal1!C11,IF(cal!$S$7=10,ExtraTaal2!C11,IF(cal!$S$7=11,ExtraTaal3!C11,)))))))))))","v":0},{"$f":"IF($S$7=1,NL!D11,IF(cal!$S$7=2,EN!D11,IF(cal!$S$7=3,DE!D11,IF(cal!$S$7=4,FR!D11,IF(cal!$S$7=5,NR!D11,IF(cal!$S$7=6,SP!D11,IF(cal!$S$7=7,SW!D11,IF(cal!$S$7=8,TS!D11,IF(cal!$S$7=9,ExtraTaal1!D11,IF(cal!$S$7=10,ExtraTaal2!D11,IF(cal!$S$7=11,ExtraTaal3!D11,)))))))))))","v":0},{"$f":"Luchtverhitter!E10","v":20},{"$f":"F9","v":"°C"},{"$f":"B11","v":"Ruimte"},{"$f":"IF($S$7=1,NL!H11,IF(cal!$S$7=2,EN!H11,IF(cal!$S$7=3,DE!H11,IF(cal!$S$7=4,FR!H11,))))","v":0},null,null,{"$f":"Luchtverhitter!K10","v":27},{"$f":"F9","v":"°C"},{"$nulls":6},{"$f":"IF($W$4=1,E11,IF($W$4=2,(E11-32)/1.8))","v":{"v":20,"d":"20.0"}},{"$nulls":3},{"$f":"IF($W$4=1,K11,IF($W$4=2,(K11-32)/1.8))","v":{"v":27,"d":"27.0"}},null,{"$f":"IF($W$4=1,(101325*(1-((0.0065*M8)/(288.15)))^((9.81*0.028964)/(8.31447*0.0065))),IF($W$4=2,(101325*(1-((0.0065*(M8*0.3048))/(288.15)))^((9.81*0.028964)/(8.31447*0.0065)))))","v":101325},{"$f":"IF($W$4=1,M8/1000,IF($W$4=2,M8*0.0003048))","v":0},{"$f":"-(0.000265264729874266*Z11^6)+(0.000957582908802335*Z11^5)+(0.00470250661483425*Z11^4)-(0.0298716926548353*Z11^3)+(0.0557086806557086*Z11^2)-(0.0484008125693582*Z11)+1","v":1},{"$f":"(90+70)/2-15","v":65},{"$f":"((E9+E10)/2)-E11","v":30},{"$f":"K11-((K9+K10)/2)","v":9.88888888888889},{"$nulls":4},{"$f":"IF((237.3*LN(($AQ$1*EXP(17.27*($AM$3/($AM$3+237.3))))))/(17.27-LN(($AQ$1*EXP(17.27*($AM$3/($AM$3+237.3))))))<(($AM$1+$AM$2)/2),1,IF(1/(1+((2258*((0.622/((101325/(1*611*EXP(17.27*((($AM$1+$AM$2)/2)/((($AM$1+$AM$2)/2)+237.3))))))-1)*1000-(0.622/((101325/($AQ$1*611*EXP(17.27*($AM$3/($AM$3+237.3))))))-1)*1000))/(1005*((($AM$1+$AM$2)/2)-$AM$3))))>1,1,1/(1+((2258*((0.622/((101325/(1*611*EXP(17.27*((($AM$1+$AM$2)/2)/((($AM$1+$AM$2)/2)+237.3))))))-1)*1000-(0.622/((101325/($AQ$1*611*EXP(17.27*($AM$3/($AM$3+237.3))))))-1)*1000))/(1005*((($AM$1+$AM$2)/2)-$AM$3))))))","v":1}]
[{"$nulls":6},{"$f":"IF($S$7=1,NL!G12,IF(cal!$S$7=2,EN!G12,IF(cal!$S$7=3,DE!G12,IF(cal!$S$7=4,FR!G12,IF(cal!$S$7=5,NR!G12,IF(cal!$S$7=6,SP!G12,IF(cal!$S$7=7,SW!G12,IF(cal!$S$7=8,TS!G12,IF(cal!$S$7=9,ExtraTaal1!G12,IF(cal!$S$7=10,ExtraTaal2!G12,IF(cal!$S$7=11,ExtraTaal3!G12,)))))))))))","v":"Relatieve vochtigheid"},{"$nulls":3},{"$f":"Luchtverhitter!K11","v":{"v":0.5,"d":"50%"}},{"$nulls":11},{"$f":"Luchtverhitter!K11","v":{"v":0.5,"d":"50%"}}]
[]
[{"$nulls":3},{"$f":"IF($W$4=1,1,IF($W$4=2,3.412141633))","v":{"v":1,"d":"1.0000"}},{"$f":"IF($W$4=1,1,IF($W$4=2,0.004403))","v":{"v":1,"d":"1.0000"}},{"$f":"IF($W$4=1,1,IF($W$4=2,4.0147))","v":{"v":1,"d":"1.0000"}},{"$f":"IF($W$4=1,1,IF($W$4=2,3.412141633))","v":{"v":1,"d":"1.0000"}},{"$f":"IF($W$4=1,1,IF($W$4=2,3.412141633))","v":{"v":1,"d":"1.0000"}},{"$f":"IF($W$4=1,1,IF($W$4=2,0.004403))","v":{"v":1,"d":"1.0000"}},{"$f":"IF($W$4=1,1,IF($W$4=2,4.0147))","v":{"v":1,"d":"1.0000"}},{"$f":"IF($W$4=1,0.000334444444444444,IF($W$4=2,0.000568224721372))","v":0.000334444444444444},null,{"$f":"IF($W$4=1,1,IF($W$4=2,1.8))","v":1},{"$f":"IF($W$4=1,1,IF($W$4=2,0.588575))","v":{"v":1,"d":"1.0000"}},{"$f":"IF($W$4=1,0,IF($W$4=2,32))","v":{"v":0,"d":"0.0000"}}]
[null,{"$f":"IF($S$7=1,NL!B15,IF(cal!$S$7=2,EN!B15,IF(cal!$S$7=3,DE!B15,IF(cal!$S$7=4,FR!B15,IF(cal!$S$7=5,NR!B15,IF(cal!$S$7=6,SP!B15,IF(cal!$S$7=7,SW!B15,IF(cal!$S$7=8,TS!B15,IF(cal!$S$7=9,ExtraTaal1!B15,IF(cal!$S$7=10,ExtraTaal2!B15,IF(cal!$S$7=11,ExtraTaal3!B15,)))))))))))","v":"Snelheidsniveau"},{"$f":"IF($S$7=1,NL!C15,IF(cal!$S$7=2,EN!C15,IF(cal!$S$7=3,DE!C15,IF(cal!$S$7=4,FR!C15,IF(cal!$S$7=5,NR!C15,IF(cal!$S$7=6,SP!C15,IF(cal!$S$7=7,SW!C15,IF(cal!$S$7=8,TS!C15,IF(cal!$S$7=9,ExtraTaal1!C15,IF(cal!$S$7=10,ExtraTaal2!C15,IF(cal!$S$7=11,ExtraTaal3!C15,)))))))))))","v":"Stuurspanning [V]"},{"$f":"IF($S$7=1,NL!D15,IF(cal!$S$7=2,EN!D15,IF(cal!$S$7=3,DE!D15,IF(cal!$S$7=4,FR!D15,IF(cal!$S$7=5,NR!D15,IF(cal!$S$7=6,SP!D15,IF(cal!$S$7=7,SW!D15,IF(cal!$S$7=8,TS!D15,IF(cal!$S$7=9,ExtraTaal1!D15,IF(cal!$S$7=10,ExtraTaal2!D15,IF(cal!$S$7=11,ExtraTaal3!D15,)))))))))))","v":"Warmteafgifte  55/45/20 [kW]"},{"$f":"IF($S$7=1,NL!E15,IF(cal!$S$7=2,EN!E15,IF(cal!$S$7=3,DE!E15,IF(cal!$S$7=4,FR!E15,IF(cal!$S$7=5,NR!E15,IF(cal!$S$7=6,SP!E15,IF(cal!$S$7=7,SW!E15,IF(cal!$S$7=8,TS!E15,IF(cal!$S$7=9,ExtraTaal1!E15,IF(cal!$S$7=10,ExtraTaal2!E15,IF(cal!$S$7=11,ExtraTaal3!E15,)))))))))))","v":"Waterdebiet, verwarming [l/h]"},{"$f":"IF($S$7=1,NL!F15,IF(cal!$S$7=2,EN!F15,IF(cal!$S$7=3,DE!F15,IF(cal!$S$7=4,FR!F15,IF(cal!$S$7=5,NR!F15,IF(cal!$S$7=6,SP!F15,IF(cal!$S$7=7,SW!F15,IF(cal!$S$7=8,TS!F15,IF(cal!$S$7=9,ExtraTaal1!F15,IF(cal!$S$7=10,ExtraTaal2!F15,IF(cal!$S$7=11,ExtraTaal3!F15,)))))))))))","v":"Waterzijdig drukverlies [kPa]"},{"$f":"IF($S$7=1,NL!G15,IF(cal!$S$7=2,EN!G15,IF(cal!$S$7=3,DE!G15,IF(cal!$S$7=4,FR!G15,IF(cal!$S$7=5,NR!G15,IF(cal!$S$7=6,SP!G15,IF(cal!$S$7=7,SW!G15,IF(cal!$S$7=8,TS!G15,IF(cal!$S$7=9,ExtraTaal1!G15,IF(cal!$S$7=10,ExtraTaal2!G15,IF(cal!$S$7=11,ExtraTaal3!G15,)))))))))))","v":"Voelb. Koelcapaciteit  16/18/27 [kW]"},null,{"$f":"IF($S$7=1,NL!I15,IF(cal!$S$7=2,EN!I15,IF(cal!$S$7=3,DE!I15,IF(cal!$S$7=4,FR!I15,IF(cal!$S$7=5,NR!I15,IF(cal!$S$7=6,SP!I15,IF(cal!$S$7=7,SW!I15,IF(cal!$S$7=8,TS!I15,IF(cal!$S$7=9,ExtraTaal1!I15,IF(cal!$S$7=10,ExtraTaal2!I15,IF(cal!$S$7=11,ExtraTaal3!I15,)))))))))))","v":"Toerental [u/min]"},{"$f":"IF($S$7=1,NL!J15,IF(cal!$S$7=2,EN!J15,IF(cal!$S$7=3,DE!J15,IF(cal!$S$7=4,FR!J15,IF(cal!$S$7=5,NR!J15,IF(cal!$S$7=6,SP!J15,IF(cal!$S$7=7,SW!J15,IF(cal!$S$7=8,TS!J15,IF(cal!$S$7=9,ExtraTaal1!J15,IF(cal!$S$7=10,ExtraTaal2!J15,IF(cal!$S$7=11,ExtraTaal3!J15,)))))))))))","v":"Waterzijdig drukverlies [kPa]"},{"$f":"IF($S$7=1,NL!K15,IF(cal!$S$7=2,EN!K15,IF(cal!$S$7=3,DE!K15,IF(cal!$S$7=4,FR!K15,IF(cal!$S$7=5,NR!K15,IF(cal!$S$7=6,SP!K15,IF(cal!$S$7=7,SW!K15,IF(cal!$S$7=8,TS!K15,IF(cal!$S$7=9,ExtraTaal1!K15,IF(cal!$S$7=10,ExtraTaal2!K15,IF(cal!$S$7=11,ExtraTaal3!K15,)))))))))))","v":"Geluidsdruk ** [dB(A)]"},{"$f":"IF($S$7=1,NL!L15,IF(cal!$S$7=2,EN!L15,IF(cal!$S$7=3,DE!L15,IF(cal!$S$7=4,FR!L15,IF(cal!$S$7=5,NR!L15,IF(cal!$S$7=6,SP!L15,IF(cal!$S$7=7,SW!L15,IF(cal!$S$7=8,TS!L15,IF(cal!$S$7=9,ExtraTaal1!L15,IF(cal!$S$7=10,ExtraTaal2!L15,IF(cal!$S$7=11,ExtraTaal3!L15,)))))))))))","v":"Geluidsvermogen * [dB(A)]"},{"$f":"IF($S$7=1,NL!M15,IF(cal!$S$7=2,EN!M15,IF(cal!$S$7=3,DE!M15,IF(cal!$S$7=4,FR!M15,IF(cal!$S$7=5,NR!M15,IF(cal!$S$7=6,SP!M15,IF(cal!$S$7=7,SW!M15,IF(cal!$S$7=8,TS!M15,IF(cal!$S$7=9,ExtraTaal1!M15,IF(cal!$S$7=10,ExtraTaal2!M15,IF(cal!$S$7=11,ExtraTaal3!M15,)))))))))))","v":"Opgenomen elektr. vermogen [W]"},{"$f":"IF($S$7=1,NL!N15,IF(cal!$S$7=2,EN!N15,IF(cal!$S$7=3,DE!N15,IF(cal!$S$7=4,FR!N15,IF(cal!$S$7=5,NR!N15,IF(cal!$S$7=6,SP!N15,IF(cal!$S$7=7,SW!N15,IF(cal!$S$7=8,TS!N15,IF(cal!$S$7=9,ExtraTaal1!N15,IF(cal!$S$7=10,ExtraTaal2!N15,IF(cal!$S$7=11,ExtraTaal3!N15,)))))))))))","v":"Luchtdebiet [m³/h]"},{"$f":"IF($S$7=1,NL!O15,IF(cal!$S$7=2,EN!O15,IF(cal!$S$7=3,DE!O15,IF(cal!$S$7=4,FR!O15,IF(cal!$S$7=5,NR!O15,IF(cal!$S$7=6,SP!O15,IF(cal!$S$7=7,SW!O15,IF(cal!$S$7=8,TS!O15,IF(cal!$S$7=9,ExtraTaal1!O15,IF(cal!$S$7=10,ExtraTaal2!O15,IF(cal!$S$7=11,ExtraTaal3!O15,)))))))))))","v":"Uitblaastemp. verwarming  [°C]"},{"$f":"IF($S$7=1,NL!P15,IF(cal!$S$7=2,EN!P15,IF(cal!$S$7=3,DE!P15,IF(cal!$S$7=4,FR!P15,IF(cal!$S$7=5,NR!P15,IF(cal!$S$7=6,SP!P15,IF(cal!$S$7=7,SW!P15,IF(cal!$S$7=8,TS!P15,IF(cal!$S$7=9,ExtraTaal1!P15,IF(cal!$S$7=10,ExtraTaal2!P15,IF(cal!$S$7=11,ExtraTaal3!P15,)))))))))))","v":"Uitblaastemp. koeling  [°C]"},{"$nulls":6},"Q_verw","dP_verw","Q_voelb_c","oppWW","Geluid_P","P_elek","V_air",null,"Q_verw","toerental n[u/min]","Q_voelb_c","dP_cool","Geluid_P","P_elek","V_air","Q_verw","toerental n[u/min]","Q_voelb_c","dP_cool","Geluid_P","P_elek","V_air","Q_verw","toerental n[u/min]","Q_voelb_c","dP_cool","Geluid_P","P_elek","V_air","Q_verw","toerental n[u/min]","Q_voelb_c","dP_cool","Geluid_P","P_elek","V_air","Q_verw","toerental n[u/min]","Q_voelb_c","dP_cool","Geluid_P","P_elek","V_air"]
[null,{"$f":"IF($S$7=1,NL!B16,IF(cal!$S$7=2,EN!B16,IF(cal!$S$7=3,DE!B16,IF(cal!$S$7=4,FR!B16,IF(cal!$S$7=5,NR!B16,IF(cal!$S$7=6,SP!B16,IF(cal!$S$7=7,SW!B16,IF(cal!$S$7=8,TS!B16,IF(cal!$S$7=9,ExtraTaal1!B16,IF(cal!$S$7=10,ExtraTaal2!B16,IF(cal!$S$7=11,ExtraTaal3!B16,)))))))))))","v":"Luchtverhitter hoogte 41 cm breedte 41 cm lengte 43 cm (Type 021)"},{"$f":"IF($S$7=1,NL!C16,IF(cal!$S$7=2,EN!C16,IF(cal!$S$7=3,DE!C16,IF(cal!$S$7=4,FR!C16,IF(cal!$S$7=5,NR!C16,IF(cal!$S$7=6,SP!C16,))))))","v":0},{"$f":"IF($S$7=1,NL!D16,IF(cal!$S$7=2,EN!D16,IF(cal!$S$7=3,DE!D16,IF(cal!$S$7=4,FR!D16,IF(cal!$S$7=5,NR!D16,IF(cal!$S$7=6,SP!D16,))))))","v":0},{"$f":"IF($S$7=1,NL!E16,IF(cal!$S$7=2,EN!E16,IF(cal!$S$7=3,DE!E16,IF(cal!$S$7=4,FR!E16,IF(cal!$S$7=5,NR!E16,IF(cal!$S$7=6,SP!E16,))))))","v":0},{"$f":"IF($S$7=1,NL!F16,IF(cal!$S$7=2,EN!F16,IF(cal!$S$7=3,DE!F16,IF(cal!$S$7=4,FR!F16,IF(cal!$S$7=5,NR!F16,IF(cal!$S$7=6,SP!F16,))))))","v":0},{"$f":"IF($S$7=1,NL!G16,IF(cal!$S$7=2,EN!G16,IF(cal!$S$7=3,DE!G16,IF(cal!$S$7=4,FR!G16,IF(cal!$S$7=5,NR!G16,IF(cal!$S$7=6,SP!G16,))))))","v":0},{"$f":"IF($S$7=1,NL!H16,IF(cal!$S$7=2,EN!H16,IF(cal!$S$7=3,DE!H16,IF(cal!$S$7=4,FR!H16,IF(cal!$S$7=5,NR!H16,IF(cal!$S$7=6,SP!H16,))))))","v":0},{"$f":"IF($S$7=1,NL!I16,IF(cal!$S$7=2,EN!I16,IF(cal!$S$7=3,DE!I16,IF(cal!$S$7=4,FR!I16,IF(cal!$S$7=5,NR!I16,IF(cal!$S$7=6,SP!I16,))))))","v":0},{"$f":"IF($S$7=1,NL!J16,IF(cal!$S$7=2,EN!J16,IF(cal!$S$7=3,DE!J16,IF(cal!$S$7=4,FR!J16,IF(cal!$S$7=5,NR!J16,IF(cal!$S$7=6,SP!J16,))))))","v":0},{"$f":"IF($S$7=1,NL!K16,IF(cal!$S$7=2,EN!K16,IF(cal!$S$7=3,DE!K16,IF(cal!$S$7=4,FR!K16,IF(cal!$S$7=5,NR!K16,IF(cal!$S$7=6,SP!K16,))))))","v":0},{"$f":"IF($S$7=1,NL!L16,IF(cal!$S$7=2,EN!L16,IF(cal!$S$7=3,DE!L16,IF(cal!$S$7=4,FR!L16,IF(cal!$S$7=5,NR!L16,IF(cal!$S$7=6,SP!L16,))))))","v":0},{"$f":"IF($S$7=1,NL!M16,IF(cal!$S$7=2,EN!M16,IF(cal!$S$7=3,DE!M16,IF(cal!$S$7=4,FR!M16,IF(cal!$S$7=5,NR!M16,IF(cal!$S$7=6,SP!M16,))))))","v":0},{"$f":"IF($S$7=1,NL!N16,IF(cal!$S$7=2,EN!N16,IF(cal!$S$7=3,DE!N16,IF(cal!$S$7=4,FR!N16,IF(cal!$S$7=5,NR!N16,IF(cal!$S$7=6,SP!N16,))))))","v":0},{"$f":"IF($S$7=1,NL!O16,IF(cal!$S$7=2,EN!O16,IF(cal!$S$7=3,DE!O16,IF(cal!$S$7=4,FR!O16,IF(cal!$S$7=5,NR!O16,IF(cal!$S$7=6,SP!O16,))))))","v":0},{"$f":"IF($S$7=1,NL!P16,IF(cal!$S$7=2,EN!P16,IF(cal!$S$7=3,DE!P16,IF(cal!$S$7=4,FR!P16,IF(cal!$S$7=5,NR!P16,IF(cal!$S$7=6,SP!P16,))))))","v":0},null,null,"n-value",{"$nulls":3},{"$f":"IF(Luchtverhitter!$K$4=cal!$X2,0,IF(Luchtverhitter!$K$4=cal!$X3,1,IF(Luchtverhitter!$K$4=cal!$X4,2,IF(Luchtverhitter!$K$4=cal!$X5,3,IF(Luchtverhitter!$K$4=cal!$X6,4,IF(Luchtverhitter!$K$4=cal!$X7,5,IF(Luchtverhitter!$K$4=cal!$X8,7,IF(Luchtverhitter!$K$4=cal!$X9,8,))))))))","v":0},{"$nulls":7},0,{"$nulls":6},1,{"$nulls":6},2,{"$nulls":6},3,{"$nulls":6},4,{"$nulls":13},321,{"$nulls":6},331,{"$nulls":6},332,{"$nulls":6},333]
[null,{"v":0.2,"d":"20%"},2,{"$f":"(W17/1000)*($AC$11/$AB$11)*$D$14*$AA$11","v":{"v":2.676923076923077,"d":"2.7"}},null,null,{"$f":"IF($AI$11=1,W17/1000*($AD$11/$AB$11)*$G$14*$AA$11,\"\")","v":{"v":0.8823931623931625,"d":"0.9"}},null,{"$f":"X17","v":731},null,{"$f":"L17-16","v":{"v":34,"d":"34.0"}},{"$f":"AA17","v":{"v":50,"d":"50.0"}},{"v":10,"d":"10.0"},{"$f":"AC17*$N$14","v":594},{"$f":"(Tl_heat+((($D17*1000)/$G$14)/(1006*$N17*$K$14)))*$M$14+$O$14","v":{"v":33.39453001573305,"d":"33.4"}},{"$f":"IF($AI$11=1,(Tl_cool-(($G17*1000/$G$14)/(1006*$N17*$K$14)))*$M$14+$O$14,\"\")","v":{"v":22.584766031850958,"d":"22.6"}},null,null,{"v":1,"d":"1.000"},{"$nulls":3},{"$f":"IF($W$16=0,AE17,IF($W$16=1,AL17,IF($W$16=2,AS17,IF($W$16=3,AZ17,IF($W$16=4,BG17,IF($W$16=5,BN17,IF($W$16=7,BU17,IF($W$16=8,CB17))))))))","v":{"v":5800,"d":"5800.00"}},731,882.3931623931625,0,50,{"v":10,"d":"10.000"},594,"c",5800,731,{"$f":"AE17*($AD$11/$AB$11)","v":{"v":882.3931623931625,"d":"882.393"}},null,{"v":50,"d":"50.0"},{"v":10,"d":"10.000"},594,10348,458,{"$f":"AL17*($AD$11/$AB$11)","v":{"v":1574.3111111111114,"d":"1574.3"}},null,41.2,{"v":8,"d":"8.0"},699,23342,515,{"$f":"AS17*($AD$11/$AB$11)","v":{"v":3551.1760683760685,"d":"3551.2"}},null,57.8,{"v":27,"d":"27.0"},1773,29259,274,{"$f":"AZ17*($AD$11/$AB$11)","v":{"v":4451.369230769231,"d":"4451.4"}},null,43.3,{"v":20,"d":"20.0"},1403,38569,291,{"$f":"BG17*($AD$11/$AB$11)","v":{"v":5867.762393162394,"d":"5867.8"}},null,46.2,{"v":30,"d":"30.0"},2207]
[null,{"v":0.4,"d":"40%"},4,{"$f":"(W18/1000)*($AC$11/$AB$11)*$D$14*$AA$11","v":{"v":3.276923076923077,"d":"3.3"}},null,null,{"$f":"IF($AI$11=1,W18/1000*($AD$11/$AB$11)*$G$14*$AA$11,\"\")","v":{"v":1.0801709401709403,"d":"1.1"}},null,{"$f":"X18","v":984},null,{"$f":"L18-16","v":42.4},58.4,{"v":20,"d":"20.0"},{"$f":"AC18*$N$14","v":847},{"$f":"(Tl_heat+((($D18*1000)/$G$14)/(1006*$N18*$K$14)))*$M$14+$O$14","v":{"v":31.499021065902486,"d":"31.5"}},{"v":23.209581944943253,"d":"23.2"},null,null,{"v":1,"d":"1.000"},{"$nulls":3},{"$f":"IF($W$16=0,AE18,IF($W$16=1,AL18,IF($W$16=2,AS18,IF($W$16=3,AZ18,IF($W$16=4,BG18,IF($W$16=5,BN18,IF($W$16=7,BU18,IF($W$16=8,CB18))))))))","v":{"v":7100,"d":"7100.00"}},{"$f":"IF($W$16=0,AF18,IF($W$16=1,AM18,IF($W$16=2,AT18,IF($W$16=3,BA18,IF($W$16=4,BH18,IF($W$16=5,BO18,IF($W$16=7,BV18,IF($W$16=8,CC18))))))))","v":984},{"$f":"IF($W$16=0,AG18,IF($W$16=1,AN18,IF($W$16=2,AU18,IF($W$16=3,BB18,IF($W$16=4,BI18,IF($W$16=5,BP18,IF($W$16=7,BW18,IF($W$16=8,CD18))))))))","v":1080.1709401709402},{"$f":"IF($W$16=0,AH18,IF($W$16=1,AO18,IF($W$16=2,AV18,IF($W$16=3,BC18,IF($W$16=4,BJ18,IF($W$16=5,BQ18,IF($W$16=7,BX18,IF($W$16=8,CE18))))))))","v":0},{"$f":"IF($W$16=0,AI18,IF($W$16=1,AP18,IF($W$16=2,AW18,IF($W$16=3,BD18,IF($W$16=4,BK18,IF($W$16=5,BR18,IF($W$16=7,BY18,IF($W$16=8,CF18))))))))","v":58.4},{"$f":"IF($W$16=0,AJ18,IF($W$16=1,AQ18,IF($W$16=2,AX18,IF($W$16=3,BE18,IF($W$16=4,BL18,IF($W$16=5,BS18,IF($W$16=7,BZ18,IF($W$16=8,CG18))))))))","v":{"v":20,"d":"20.000"}},{"$f":"IF($W$16=0,AK18,IF($W$16=1,AR18,IF($W$16=2,AY18,IF($W$16=3,BF18,IF($W$16=4,BM18,IF($W$16=5,BT18,IF($W$16=7,CA18,IF($W$16=8,CH18))))))))","v":847},"d",7100,984,{"$f":"AE18*($AD$11/$AB$11)","v":{"v":1080.1709401709402,"d":"1080.171"}},null,58.4,{"v":20,"d":"20.000"},847,13849,614,{"$f":"AL18*($AD$11/$AB$11)","v":{"v":2106.9418803418807,"d":"2106.9"}},null,49.3,{"v":14,"d":"14.0"},997,28268,703,{"$f":"AS18*($AD$11/$AB$11)","v":{"v":4300.60170940171,"d":"4300.6"}},null,59.3,{"v":54,"d":"54.0"},2517,37838,378,{"$f":"AZ18*($AD$11/$AB$11)","v":{"v":5756.5504273504275,"d":"5756.6"}},null,51.6,{"v":34,"d":"34.0"},2036,45623,399,{"$f":"BG18*($AD$11/$AB$11)","v":{"v":6940.935042735044,"d":"6940.9"}},null,53.8,{"v":54,"d":"54.0"},3107]
[null,{"v":0.6,"d":"60%"},6,{"$f":"(W19/1000)*($AC$11/$AB$11)*$D$14*$AA$11","v":{"v":3.8307692307692314,"d":"3.8"}},null,null,{"v":1.262735042735043,"d":"1.3"},null,{"$f":"X19","v":1286},null,{"$f":"L19-16","v":{"v":50.099999999999994,"d":"50.1"}},66.1,{"v":43,"d":"43.0"},{"$f":"AC19*$N$14","v":1144},{"$f":"(Tl_heat+((($D19*1000)/$G$14)/(1006*$N19*$K$14)))*$M$14+$O$14","v":{"v":29.952633211292362,"d":"30.0"}},{"v":23.71931720072215,"d":"23.7"},null,null,{"v":1,"d":"1.000"},{"$nulls":3},{"v":8300,"d":"8300.00"},1286,1262.735042735043,{"$f":"IF($W$16=0,AH19,IF($W$16=1,AO19,IF($W$16=2,AV19,IF($W$16=3,BC19,IF($W$16=4,BJ19,IF($W$16=5,BQ19,IF($W$16=7,BX19,IF($W$16=8,CE19))))))))","v":0},66.1,{"v":43,"d":"43.000"},1144,"e",8300,1286,{"$f":"AE19*($AD$11/$AB$11)","v":{"v":1262.735042735043,"d":"1262.735"}},null,66.1,{"v":43,"d":"43.000"},1144,16858,857,{"$f":"AL19*($AD$11/$AB$11)","v":{"v":2564.721367521368,"d":"2564.7"}},null,57.9,{"v":35,"d":"35.0"},1438,34279,936,{"$f":"AS19*($AD$11/$AB$11)","v":{"v":5215.095726495727,"d":"5215.1"}},null,67.6,{"v":115,"d":"115.0"},3467,46835,515,{"$f":"AZ19*($AD$11/$AB$11)","v":{"v":7125.324786324787,"d":"7125.3"}},null,59.1,{"v":69,"d":"69.0"},2998,57515,539,{"$f":"BG19*($AD$11/$AB$11)","v":{"v":8750.1452991453,"d":"8750.1"}},null,62.2,{"v":113,"d":"113.0"},4344]
[null,{"v":0.8,"d":"80%"},8,{"$f":"(W20/1000)*($AC$11/$AB$11)*$D$14*$AA$11","v":{"v":4.246153846153846,"d":"4.2"}},null,null,{"v":1.3996581196581197,"d":"1.4"},null,{"$f":"X20","v":1469},null,{"$f":"L20-16","v":{"v":53.900000000000006,"d":"53.9"}},69.9,{"v":63,"d":"63.0"},{"$f":"AC20*$N$14","v":1325},{"$f":"(Tl_heat+((($D20*1000)/$G$14)/(1006*$N20*$K$14)))*$M$14+$O$14","v":{"v":29.52484419388132,"d":"29.5"}},{"v":23.86032913609097,"d":"23.9"},null,null,{"v":1,"d":"1.000"},{"$nulls":3},{"v":9200,"d":"9200.00"},1469,1399.6581196581199,{"$f":"IF($W$16=0,AH20,IF($W$16=1,AO20,IF($W$16=2,AV20,IF($W$16=3,BC20,IF($W$16=4,BJ20,IF($W$16=5,BQ20,IF($W$16=7,BX20,IF($W$16=8,CE20))))))))","v":0},69.9,{"v":63,"d":"63.000"},1325,"f",9200,1469,{"$f":"AE20*($AD$11/$AB$11)","v":{"v":1399.6581196581199,"d":"1399.658"}},null,69.9,{"v":63,"d":"63.000"},1325,18983,1143,{"$f":"AL20*($AD$11/$AB$11)","v":{"v":2888.011965811966,"d":"2888.0"}},null,65.5,{"v":80,"d":"80.0"},1984,37231,1117,{"$f":"AS20*($AD$11/$AB$11)","v":{"v":5664.2034188034195,"d":"5664.2"}},null,71.5,{"v":187,"d":"187.0"},4153,50973,722,{"$f":"AZ20*($AD$11/$AB$11)","v":{"v":7754.866666666668,"d":"7754.9"}},null,67.7,{"v":158,"d":"158.0"},4254,69630,731,{"$f":"BG20*($AD$11/$AB$11)","v":{"v":10593.282051282053,"d":"10593.3"}},null,70.6,{"v":249,"d":"249.0"},6004]
[null,{"v":1,"d":"100%"},10,{"$f":"(W21/1000)*($AC$11/$AB$11)*$D$14*$AA$11","v":{"v":4.384615384615385,"d":"4.4"}},null,null,{"v":1.4452991452991455,"d":"1.4"},null,{"$f":"X21","v":1559},null,{"$f":"L21-16","v":{"v":55.400000000000006,"d":"55.4"}},71.4,{"v":76,"d":"76.0"},{"$f":"AC21*$N$14","v":1422},{"$f":"(Tl_heat+((($D21*1000)/$G$14)/(1006*$N21*$K$14)))*$M$14+$O$14","v":{"v":29.16452457427392,"d":"29.2"}},{"v":23.979101158850447,"d":"24.0"},null,null,{"v":1,"d":"1.000"},{"$nulls":3},{"v":9500,"d":"9500.00"},1559,1445.2991452991455,{"$f":"IF($W$16=0,AH21,IF($W$16=1,AO21,IF($W$16=2,AV21,IF($W$16=3,BC21,IF($W$16=4,BJ21,IF($W$16=5,BQ21,IF($W$16=7,BX21,IF($W$16=8,CE21))))))))","v":0},71.4,{"v":76,"d":"76.000"},1422,"g",9500,1559,{"$f":"AE21*($AD$11/$AB$11)","v":{"v":1445.2991452991455,"d":"1445.299"}},null,71.4,{"v":76,"d":"76.000"},1422,20467,1413,{"$f":"AL21*($AD$11/$AB$11)","v":{"v":3113.7829059829064,"d":"3113.8"}},null,71.2,{"v":115,"d":"115.0"},2422,39475,1232,{"$f":"AS21*($AD$11/$AB$11)","v":{"v":6005.598290598291,"d":"6005.6"}},null,75.2,{"v":248,"d":"248.0"},4643,52259,826,{"$f":"AZ21*($AD$11/$AB$11)","v":{"v":7950.514529914531,"d":"7950.5"}},null,71.1,{"v":232,"d":"232.0"},4915,84764,972,{"$f":"BG21*($AD$11/$AB$11)","v":{"v":12895.719658119659,"d":"12895.7"}},null,78.3,{"v":569,"d":"569.0"},8147]
[null,{"$f":"IF($S$7=1,NL!B22,IF(cal!$S$7=2,EN!B22,IF(cal!$S$7=3,DE!B22,IF(cal!$S$7=4,FR!B22,IF(cal!$S$7=5,NR!B22,IF(cal!$S$7=6,SP!B22,IF(cal!$S$7=7,SW!B22,IF(cal!$S$7=8,TS!B22,IF(cal!$S$7=9,ExtraTaal1!B22,IF(cal!$S$7=10,ExtraTaal2!B22,IF(cal!$S$7=11,ExtraTaal3!B22,)))))))))))","v":"Luchtverhitter hoogte 41 cm breedte 41 cm lengte 43 cm (Type 031)"},{"$f":"IF($AI$11=1,(Tl_cool-(($G22/$G$14)/(1006*$N22*$K$14)))*$M$14+$O$14,\"\")","v":{"$error":"#VALUE!"}},{"$nulls":3},{"$error":"#VALUE!"},{"$nulls":8},{"$error":"#VALUE!"},null,null,"n-value",{"$nulls":3},"H",{"v":41,"d":"41.0"},"B",{"$f":"X22","v":{"v":41,"d":"41.0"}},"L",43,21,null,"H",41,"B",41,"L",43,21,null,53,null,53,null,48,21,null,65,null,65,null,49.8,21,null,77,null,77,null,57.2,21,null,89,null,89,null,59.2,21]
[null,{"v":0.2,"d":"20%"},2,{"$f":"(W23/1000)*($AC$11/$AB$11)*$D$14*$AA$11","v":{"v":3.184615384615385,"d":"3.2"}},null,null,{"v":1.0497435897435898,"d":"1.0"},null,{"$f":"X23","v":731},null,{"$f":"L23-16","v":{"v":33,"d":"33.0"}},{"$f":"AA23","v":{"v":49,"d":"49.0"}},{"v":11,"d":"11.0"},{"$f":"AC23*$N$14","v":561},{"$f":"(Tl_heat+((($D23*1000)/$G$14)/(1006*$N23*$K$14)))*$M$14+$O$14","v":{"v":36.87221732204914,"d":"36.9"}},{"v":21.438417253102322,"d":"21.4"},null,null,{"v":1,"d":"1.000"},{"$nulls":3},6900,731,{"v":1049.7435897435898,"d":"1049.7"},null,{"v":49,"d":"49.0"},{"v":11,"d":"11.000"},561,"c",6900,731,{"$f":"AE23*($AD$11/$AB$11)","v":{"v":1049.7435897435898,"d":"1049.7"}},null,{"v":49,"d":"49.0"},{"v":11,"d":"11.000"},561,11932,458,{"$f":"AL23*($AD$11/$AB$11)","v":{"v":1815.2957264957267,"d":"1815.3"}},null,40.2,{"v":9,"d":"9.0"},660,27597,515,{"$f":"AS23*($AD$11/$AB$11)","v":{"v":4198.517948717949,"d":"4198.5"}},null,56.8,{"v":28,"d":"28.0"},1673,32260,274,{"$f":"AZ23*($AD$11/$AB$11)","v":{"v":4907.931623931624,"d":"4907.9"}},null,42.3,{"v":21,"d":"21.0"},1324,41927,291,{"$f":"BG23*($AD$11/$AB$11)","v":{"v":6378.637606837608,"d":"6378.6"}},null,45.2,{"v":31,"d":"31.0"},2083]
[null,{"v":0.4,"d":"40%"},4,{"$f":"(W24/1000)*($AC$11/$AB$11)*$D$14*$AA$11","v":{"v":3.9230769230769234,"d":"3.9"}},null,null,{"v":1.2931623931623932,"d":"1.3"},null,{"$f":"X24","v":984},null,{"$f":"L24-16","v":41.4},57.4,{"v":21,"d":"21.0"},{"$f":"AC24*$N$14","v":799},{"$f":"(Tl_heat+((($D24*1000)/$G$14)/(1006*$N24*$K$14)))*$M$14+$O$14","v":{"v":34.593453465417156,"d":"34.6"}},{"v":22.189565339177307,"d":"22.2"},null,null,{"v":1,"d":"1.000"},{"$nulls":3},8500,984,{"v":1293.1623931623933,"d":"1293.2"},null,57.4,{"v":21,"d":"21.000"},799,"d",8500,984,{"$f":"AE24*($AD$11/$AB$11)","v":{"v":1293.1623931623933,"d":"1293.2"}},null,57.4,{"v":21,"d":"21.000"},799,15910,614,{"$f":"AL24*($AD$11/$AB$11)","v":{"v":2420.4957264957266,"d":"2420.5"}},null,48.2,{"v":15,"d":"15.0"},941,33730,703,{"$f":"AS24*($AD$11/$AB$11)","v":{"v":5131.57264957265,"d":"5131.6"}},null,58.2,{"v":55,"d":"55.0"},2375,36298,378,{"$f":"AZ24*($AD$11/$AB$11)","v":{"v":5522.25982905983,"d":"5522.3"}},null,50.3,{"v":35,"d":"35.0"},1922,54031,399,{"$f":"BG24*($AD$11/$AB$11)","v":{"v":8220.100854700855,"d":"8220.1"}},null,52.7,{"v":55,"d":"55.0"},2932]
[null,{"v":0.6,"d":"60%"},6,{"$f":"(W25/1000)*($AC$11/$AB$11)*$D$14*$AA$11","v":{"v":4.846153846153847,"d":"4.8"}},null,null,{"v":1.5974358974358975,"d":"1.6"},null,{"$f":"X25","v":1286},null,{"$f":"L25-16","v":{"v":49,"d":"49.0"}},{"v":65,"d":"65.0"},{"v":45,"d":"45.0"},{"$f":"AC25*$N$14","v":1080},{"$f":"(Tl_heat+((($D25*1000)/$G$14)/(1006*$N25*$K$14)))*$M$14+$O$14","v":{"v":33.33679497256179,"d":"33.3"}},{"v":22.60379721274815,"d":"22.6"},null,null,{"v":1,"d":"1.000"},{"$nulls":3},10500,1286,{"v":1597.4358974358977,"d":"1597.4"},null,{"v":65,"d":"65.0"},{"v":45,"d":"45.000"},1080,"e",10500,1286,{"$f":"AE25*($AD$11/$AB$11)","v":{"v":1597.4358974358977,"d":"1597.4"}},null,{"v":65,"d":"65.0"},{"v":45,"d":"45.000"},1080,21754,857,{"$f":"AL25*($AD$11/$AB$11)","v":{"v":3309.582905982906,"d":"3309.6"}},null,56.3,{"v":37,"d":"37.0"},1357,40425,936,{"$f":"AS25*($AD$11/$AB$11)","v":{"v":6150.128205128206,"d":"6150.1"}},null,69.1,{"v":117,"d":"117.0"},3272,46291,515,{"$f":"AZ25*($AD$11/$AB$11)","v":{"v":7042.562393162394,"d":"7042.6"}},null,57.9,{"v":71,"d":"71.0"},2829,69737,539,{"$f":"BG25*($AD$11/$AB$11)","v":{"v":10609.560683760685,"d":"10609.6"}},null,60.9,{"v":115,"d":"115.0"},4100]
[null,{"v":0.8,"d":"80%"},8,{"$f":"(W26/1000)*($AC$11/$AB$11)*$D$14*$AA$11","v":5.4},null,null,{"v":1.78,"d":"1.8"},null,{"$f":"X26","v":1469},null,{"$f":"L26-16","v":{"v":52,"d":"52.0"}},{"v":68,"d":"68.0"},{"v":65,"d":"65.0"},{"$f":"AC26*$N$14","v":1251},{"$f":"(Tl_heat+((($D26*1000)/$G$14)/(1006*$N26*$K$14)))*$M$14+$O$14","v":{"v":32.82964038470486,"d":"32.8"}},{"v":22.770970391708396,"d":"22.8"},null,null,{"v":1,"d":"1.000"},{"$nulls":3},11700,1469,{"v":1780.0000000000002,"d":"1780.0"},null,{"v":68,"d":"68.0"},{"v":65,"d":"65.000"},1251,"f",11700,1469,{"$f":"AE26*($AD$11/$AB$11)","v":{"v":1780.0000000000002,"d":"1780.0"}},null,{"v":68,"d":"68.0"},{"v":65,"d":"65.000"},1251,25151,1143,{"$f":"AL26*($AD$11/$AB$11)","v":{"v":3826.391452991453,"d":"3826.4"}},null,63.1,{"v":82,"d":"82.0"},1872,44964,1117,{"$f":"AS26*($AD$11/$AB$11)","v":{"v":6840.676923076924,"d":"6840.7"}},null,69.6,{"v":189,"d":"189.0"},3920,58226,722,{"$f":"AZ26*($AD$11/$AB$11)","v":{"v":8858.31452991453,"d":"8858.3"}},null,65.9,{"v":160,"d":"160.0"},4015,85020,731,{"$f":"BG26*($AD$11/$AB$11)","v":{"v":12934.666666666668,"d":"12934.7"}},null,68.9,{"v":251,"d":"251.0"},5666]
[null,{"v":1,"d":"100%"},10,{"$f":"(W27/1000)*($AC$11/$AB$11)*$D$14*$AA$11","v":{"v":5.769230769230769,"d":"5.8"}},null,null,{"v":1.9017094017094018,"d":"1.9"},null,{"$f":"X27","v":1559},null,{"$f":"L27-16","v":{"v":53.099999999999994,"d":"53.1"}},69.1,{"v":79,"d":"79.0"},{"$f":"AC27*$N$14","v":1342},{"$f":"(Tl_heat+((($D27*1000)/$G$14)/(1006*$N27*$K$14)))*$M$14+$O$14","v":{"v":32.777427587082826,"d":"32.8"}},{"v":22.788181276850477,"d":"22.8"},null,null,{"v":1,"d":"1.000"},{"$nulls":3},12500,1559,{"v":1901.7094017094018,"d":"1901.7"},null,69.1,{"v":79,"d":"79.000"},1342,"g",12500,1559,{"$f":"AE27*($AD$11/$AB$11)","v":{"v":1901.7094017094018,"d":"1901.7"}},null,69.1,{"v":79,"d":"79.000"},1342,26077,1413,{"$f":"AL27*($AD$11/$AB$11)","v":{"v":3967.2700854700856,"d":"3967.3"}},null,71.2,{"v":118,"d":"118.0"},2286,47700,1232,{"$f":"AS27*($AD$11/$AB$11)","v":{"v":7256.923076923078,"d":"7256.9"}},null,75.8,{"v":251,"d":"251.0"},4382,67259,826,{"$f":"AZ27*($AD$11/$AB$11)","v":{"v":10232.565811965813,"d":"10232.6"}},null,72.3,{"v":325,"d":"325.0"},4639,102183,972,{"$f":"BG27*($AD$11/$AB$11)","v":{"v":15545.789743589745,"d":"15545.8"}},null,76.4,{"v":572,"d":"572.0"},7689]
[{"$nulls":18},"n-value",{"$nulls":3},"H",41,"B",{"$f":"X28","v":41},"L",{"$f":"IF($W$16=0,AJ28,IF($W$16=1,AQ28,IF($W$16=2,AX28,IF($W$16=3,BE28,IF($W$16=4,BL28,IF($W$16=5,BS28,IF($W$16=7,BZ28,IF($W$16=8,CG28))))))))","v":43},{"$f":"IF($W$16=0,AK28,IF($W$16=1,AR28,IF($W$16=2,AY28,IF($W$16=3,BF28,IF($W$16=4,BM28,IF($W$16=5,BT28,IF($W$16=7,CA28,IF($W$16=8,CH28))))))))","v":31},null,"H",41,"B",43,"L",43,31,null,53,null,53,null,48,31,null,65,null,65,null,49.8,31,null,77,null,77,null,57.2,31,null,89,null,89,null,59.2,31]
[{"$nulls":18},{"v":1,"d":"1.000"},{"$nulls":24},1773]
[{"$nulls":18},{"v":1,"d":"1.000"},{"$nulls":24},2517]
[{"$nulls":18},{"v":1,"d":"1.000"},{"$nulls":24},3467]
[{"$nulls":18},{"v":1,"d":"1.000"},{"$nulls":24},4153]
[{"$nulls":18},{"v":1,"d":"1.000"},{"$nulls":24},4643]
[{"$nulls":18},"n-value"]
[{"$nulls":18},{"v":1,"d":"1.000"}]
[{"$nulls":18},{"v":1,"d":"1.000"}]
[{"$nulls":18},{"v":1,"d":"1.000"}]
[{"$nulls":18},{"v":1,"d":"1.000"}]
[{"$nulls":18},{"v":1,"d":"1.000"}]
[{"$nulls":18},"n-value"]
[{"$nulls":18},{"v":1,"d":"1.000"}]
[{"$nulls":18},{"v":1,"d":"1.000"}]
[{"$nulls":18},{"v":1,"d":"1.000"}]
[{"$nulls":18},{"v":1,"d":"1.000"}]
[{"$nulls":18},{"v":1,"d":"1.000"}]
[null,{"$f":"IF($S$7=1,NL!B40,IF(cal!$S$7=2,EN!B40,IF(cal!$S$7=3,DE!B40,IF(cal!$S$7=4,FR!B40,IF(cal!$S$7=5,NR!B40,IF(cal!$S$7=6,SP!B40,IF(cal!$S$7=7,SW!B40,IF(cal!$S$7=8,TS!B40,IF(cal!$S$7=9,ExtraTaal1!B40,IF(cal!$S$7=10,ExtraTaal2!B40,IF(cal!$S$7=11,ExtraTaal3!B40,)))))))))))","v":"*Geluidsvermogen gemeten volgens ISO 3741:2010"},{"$nulls":13},{"$f":"Luchtverhitter!N27","v":"v2025-07-25"}]
[null,{"$f":"IF($S$7=1,NL!B41,IF(cal!$S$7=2,EN!B41,IF(cal!$S$7=3,DE!B41,IF(cal!$S$7=4,FR!B41,IF(cal!$S$7=5,NR!B41,IF(cal!$S$7=6,SP!B41,IF(cal!$S$7=7,SW!B41,IF(cal!$S$7=8,TS!B41,IF(cal!$S$7=9,ExtraTaal1!B41,IF(cal!$S$7=10,ExtraTaal2!B41,IF(cal!$S$7=11,ExtraTaal3!B41,)))))))))))","v":"**Geluidsdruk bij een aangenomen ruimtedemping van 16 dB(A)"}]

{"sheet":"NL","index":2,"n_rows":41,"n_cols":20,"rows_kept":41,"hidden":true,"merged":[[3,7,3,10],[4,7,4,10],[8,1,8,3],[8,6,8,9],[8,12,8,13],[9,1,9,3],[9,6,9,9],[10,1,10,3],[10,6,10,9],[15,1,15,13],[21,1,21,13],[27,1,27,13],[33,1,33,13]]}
[]
[]
[null,"Invulformulier"]
[{"$nulls":7},"Hydraulisch mengsel:",0,0,0]
[null,"Randvoorwaarden",{"$nulls":5},"Toestel - Ventilator - Uitvoering:",0,0,0]
[]
[null,"Temperaturen",{"$nulls":14},"Kopieer alle data"]
[null,"Verwarmen:",{"$nulls":4},"Koelen:",{"$nulls":9},"SI-eenheden"]
[null,{"$f":"\"Water aanvoer\"","v":"Water aanvoer"},null,null,{"$f":"cal!E9","v":55},null,{"$f":"B9","v":"Water aanvoer"},{"$nulls":3},{"$f":"cal!K9","v":16},null,"Eenheidsstelsel",{"$nulls":3},"Imperiale-eenheden"]
[null,{"$f":"\"Water retour\"","v":"Water retour"},null,null,{"$f":"cal!E10","v":45},null,{"$f":"B10","v":"Water retour"},{"$nulls":3},{"$f":"cal!K10","v":{"v":18.22222222222222,"d":"18"}}]
[null,{"$f":"\"Ruimte\"","v":"Ruimte"},null,null,{"$f":"cal!E11","v":20},null,{"$f":"B11","v":"Ruimte"},{"$nulls":3},{"$f":"cal!K11","v":27}]
[{"$nulls":6},"Relatieve vochtigheid",{"$nulls":3},{"$f":"cal!K12","v":{"v":0.5,"d":"50%"}}]
[]
[]
[null,"Snelheidsniveau","Stuurspanning [V]",{"$f":"CONCATENATE(\"Warmteafgifte  \",ROUND(E9,0),\"/\",ROUND(E10,0),\"/\",ROUND(E11,0),\" [\"&IF(UnitsNo=1,\"kW\",IF(UnitsNo=2,\"MBH\"))&\"]\")","v":"Warmteafgifte  55/45/20 [kW]"},{"$f":"\"Waterdebiet, verwarming [\"&IF(UnitsNo=1,\"l/h\",IF(UnitsNo=2,\"GPM\"))&\"]\"","v":"Waterdebiet, verwarming [l/h]"},{"$f":"\"Waterzijdig drukverlies [\"&IF(UnitsNo=1,\"kPa\",IF(UnitsNo=2,\"inH2O\"))&\"]\"","v":"Waterzijdig drukverlies [kPa]"},{"$f":"CONCATENATE(\"Voelb. Koelcapaciteit  \",ROUND(K9,0),\"/\",,ROUND(K10,0),\"/\",,ROUND(K11,0),\" [\"&IF(UnitsNo=1,\"kW\",IF(UnitsNo=2,\"Btu/h\"))&\"]\")","v":"Voelb. Koelcapaciteit  16/18/27 [kW]"},{"$f":"CONCATENATE(\"Tot. koelcapaciteit \",,ROUND(K9,0),\"/\",,ROUND(K10,0),\"/\",,ROUND(K11,0),\" [\"&IF(UnitsNo=1,\"kW\",IF(UnitsNo=2,\"Btu/h\"))&\"]\")","v":"Tot. koelcapaciteit 16/18/27 [kW]"},{"$f":"\"Toerental [\"&IF(UnitsNo=1,\"u/min\",IF(UnitsNo=2,\"RPM\"))&\"]\"","v":"Toerental [u/min]"},{"$f":"\"Waterzijdig drukverlies [\"&IF(UnitsNo=1,\"kPa\",IF(UnitsNo=2,\"inH2O\"))&\"]\"","v":"Waterzijdig drukverlies [kPa]"},"Geluidsdruk ** [dB(A)]","Geluidsvermogen * [dB(A)]","Opgenomen elektr. vermogen [W]",{"$f":"\"Luchtdebiet [\"&IF(UnitsNo=1,\"m³/h\",IF(UnitsNo=2,\"CFM\"))&\"]\"","v":"Luchtdebiet [m³/h]"},{"$f":"\"Uitblaastemp. verwarming  [\"&IF(UnitsNo=1,\"°C\",IF(UnitsNo=2,\"°F\"))&\"]\"","v":"Uitblaastemp. verwarming  [°C]"},{"$f":"\"Uitblaastemp. koeling  [\"&IF(UnitsNo=1,\"°C\",IF(UnitsNo=2,\"°F\"))&\"]\"","v":"Uitblaastemp. koeling  [°C]"}]
[null,{"$f":"cal!$X$1&\" \"&$T$16&\" \"&ROUND(cal!X22,1)&IF(UnitsNo=1,\" cm\",IF(UnitsNo=2,\" in\"))& \" \"&$T$17&\" \"&ROUND(cal!Z22,1)&IF(UnitsNo=1,\" cm\",IF(UnitsNo=2,\" in\"))&\" \"&$T$18&\" \"&ROUND(cal!AB22,1)&IF(UnitsNo=1,\" cm\",IF(UnitsNo=2,\" in\"))&\" (Type \"&cal!W16&\"\"&cal!AC22&\")\"","v":"Luchtverhitter hoogte 41 cm breedte 41 cm lengte 43 cm (Type 021)"},{"$nulls":15},"Temp.",null,"hoogte"]
[{"$nulls":17},"verw.!",null,"breedte"]
[{"$nulls":17},"koelen!",null,"lengte"]
[]
[]
[]
[null,{"$f":"cal!$X$1&\" \"&$T$16&\" \"&ROUND(cal!X28,1)&IF(UnitsNo=1,\" cm\",IF(UnitsNo=2,\" in\"))& \" \"&$T$17&\" \"&ROUND(cal!Z28,1)&IF(UnitsNo=1,\" cm\",IF(UnitsNo=2,\" in\"))&\" \"&$T$18&\" \"&ROUND(cal!AB28,1)&IF(UnitsNo=1,\" cm\",IF(UnitsNo=2,\" in\"))&\" (Type \"&cal!W16&\"\"&cal!AC28&\")\"","v":"Luchtverhitter hoogte 41 cm breedte 41 cm lengte 43 cm (Type 031)"}]
[]
[]
[]
[]
[]
[null,{"$f":"cal!$X$1&\" \"&$T$16&\" \"&ROUND(cal!X34,1)&IF(UnitsNo=1,\" cm\",IF(UnitsNo=2,\" in\"))& \" \"&$T$17&\" \"&ROUND(cal!Z34,1)&IF(UnitsNo=1,\" cm\",IF(UnitsNo=2,\" in\"))&\" \"&$T$18&\" \"&ROUND(cal!AB34,1)&IF(UnitsNo=1,\" cm\",IF(UnitsNo=2,\" in\"))&\" (Type 3)\"","v":"Luchtverhitter hoogte 0 cm breedte 0 cm lengte 0 cm (Type 3)"}]
[]
[]
[]
[]
[]
[null,{"$f":"cal!$X$1&\" \"&$T$16&\" \"&ROUND(cal!X40,1)&IF(UnitsNo=1,\" cm\",IF(UnitsNo=2,\" in\"))& \" \"&$T$17&\" \"&ROUND(cal!Z40,1)&IF(UnitsNo=1,\" cm\",IF(UnitsNo=2,\" in\"))&\" \"&$T$18&\" \"&ROUND(cal!AB40,1)&IF(UnitsNo=1,\" cm\",IF(UnitsNo=2,\" in\"))&\" (Type 4)\"","v":"Luchtverhitter hoogte 0 cm breedte 0 cm lengte 0 cm (Type 4)"}]
[]
[]
[]
[]
[]
[null,"*Geluidsvermogen gemeten volgens ISO 3741:2010",{"$nulls":11},{"$f":"cal!P46","v":"v2025-07-25"}]
[null,"**Geluidsdruk bij een aangenomen ruimtedemping van 16 dB(A)"]

{"sheet":"EN","index":3,"n_rows":41,"n_cols":20,"rows_kept":41,"hidden":true,"merged":[[3,7,3,10],[4,7,4,10],[8,1,8,3],[8,6,8,9],[8,12,8,13],[9,1,9,3],[9,6,9,9],[10,6,10,9],[15,1,15,13],[21,1,21,13],[27,1,27,13],[33,1,33,13]]}
[]
[]
[null,"Formulary"]
[{"$nulls":7},"Hydraulic mix:",0,0,0]
[null,"Conditions",{"$nulls":5},"Device - Ventilator - Utilization:",0,0,0]
[]
[null,"Temperatures",{"$nulls":14},"Copy all data"]
[null,"Heating:",{"$nulls":4},"Cooling:",{"$nulls":9},"SI-units"]
[null,"Supply water",null,null,{"$f":"cal!E9","v":55},null,{"$f":"B9","v":"Supply water"},{"$nulls":3},{"$f":"cal!K9","v":16},null,"Unit conversion",{"$nulls":3},"Imperial-units"]
[null,"Return water",null,null,{"$f":"cal!E10","v":45},null,{"$f":"B10","v":"Return water"},{"$nulls":3},{"$f":"cal!K10","v":{"v":18.22222222222222,"d":"18"}}]
[null,"Entering air",null,null,{"$f":"cal!E11","v":20},null,{"$f":"B11","v":"Entering air"},{"$nulls":3},{"$f":"cal!K11","v":27}]
[{"$nulls":6},"Relative humidity",{"$nulls":3},{"$f":"cal!K12","v":{"v":0.5,"d":"50%"}}]
[]
[]
[null,"Speed level","Control voltage [V]",{"$f":"CONCATENATE(\"Heat output  \",ROUND(E9,0),\"/\",ROUND(E10,0),\"/\",ROUND(E11,0),\" [\"&IF(cal!$W$4=1,\"kW\",IF(cal!$W$4=2,\"MBH\"))&\"]\")","v":"Heat output  55/45/20 [kW]"},{"$f":"\"Water flowrate, heating [\"&IF(cal!$W$4=1,\"l/h\",IF(cal!$W$4=2,\"GPM\"))&\"]\"","v":"Water flowrate, heating [l/h]"},{"$f":"\"Watersided pressure loss [\"&IF(cal!$W$4=1,\"kPa\",IF(cal!$W$4=2,\"inH2O\"))&\"]\"","v":"Watersided pressure loss [kPa]"},{"$f":"CONCATENATE(\"Sens. cooling capacity  \",ROUND(K9,0),\"/\",ROUND(K10,0),\"/\",ROUND(K11,0),\" [\"&IF(cal!$W$4=1,\"kW\",IF(cal!$W$4=2,\"Btu/h\"))&\"]\")","v":"Sens. cooling capacity  16/18/27 [kW]"},{"$f":"CONCATENATE(\"Tot. cooling capacity \",ROUND(K9,0),\"/\",ROUND(K10,0),\"/\",ROUND(K11,0),\" [\"&IF(cal!$W$4=1,\"kW\",IF(cal!$W$4=2,\"Btu/h\"))&\"]\")","v":"Tot. cooling capacity 16/18/27 [kW]"},{"$f":"\"RPM [\"&IF(UnitsNo=1,\"u/min\",IF(UnitsNo=2,\"RPM\"))&\"]\"","v":"RPM [u/min]"},{"$f":"\"Watersided pressure loss [\"&IF(cal!$W$4=1,\"kPa\",IF(cal!$W$4=2,\"inH2O\"))&\"]\"","v":"Watersided pressure loss [kPa]"},"Sound pressure ** [dB(A)]","Sound power * [dB(A)]","Electrical power [W]",{"$f":"\"Air flowrate [\"&IF(cal!$W$4=1,\"m³/h\",IF(cal!$W$4=2,\"CFM\"))&\"]\"","v":"Air flowrate [m³/h]"},{"$f":"\"Air exhaust temp. heating  [\"&IF(cal!$W$4=1,\"°C\",IF(cal!$W$4=2,\"°F\"))&\"]\"","v":"Air exhaust temp. heating  [°C]"},{"$f":"\"Air exhaust temp. cooling  [\"&IF(cal!$W$4=1,\"°C\",IF(cal!$W$4=2,\"°F\"))&\"]\"","v":"Air exhaust temp. cooling  [°C]"}]
[null,{"$f":"cal!$X$1&\" \"&$T$16&\" \"&ROUND(cal!X22,1)&IF(UnitsNo=1,\" cm\",IF(UnitsNo=2,\" in\"))& \" \"&$T$17&\" \"&ROUND(cal!Z22,1)&IF(UnitsNo=1,\" cm\",IF(UnitsNo=2,\" in\"))&\" \"&$T$18&\" \"&ROUND(cal!AB22,1)&IF(UnitsNo=1,\" cm\",IF(UnitsNo=2,\" in\"))&\" (Type \"&cal!W16&\"\"&cal!AC22&\")\"","v":"Luchtverhitter height 41 cm width 41 cm length 43 cm (Type 021)"},{"$nulls":15},"Temp.",null,"height"]
[{"$nulls":17},"heating!",null,"width"]
[{"$nulls":17},"cooling!",null,"length"]
[]
[]
[]
[null,{"$f":"cal!$X$1&\" \"&$T$16&\" \"&ROUND(cal!X28,1)&IF(UnitsNo=1,\" cm\",IF(UnitsNo=2,\" in\"))& \" \"&$T$17&\" \"&ROUND(cal!Z28,1)&IF(UnitsNo=1,\" cm\",IF(UnitsNo=2,\" in\"))&\" \"&$T$18&\" \"&ROUND(cal!AB28,1)&IF(UnitsNo=1,\" cm\",IF(UnitsNo=2,\" in\"))&\" (Type \"&cal!W16&\"\"&cal!AC28&\")\"","v":"Luchtverhitter height 41 cm width 41 cm length 43 cm (Type 031)"}]
[]
[]
[]
[]
[]
[null,{"$f":"cal!$X$1&\" \"&$T$16&\" \"&ROUND(cal!X34,1)&IF(UnitsNo=1,\" cm\",IF(UnitsNo=2,\" in\"))& \" \"&$T$17&\" \"&ROUND(cal!Z34,1)&IF(UnitsNo=1,\" cm\",IF(UnitsNo=2,\" in\"))&\" \"&$T$18&\" \"&ROUND(cal!AB34,1)&IF(UnitsNo=1,\" cm\",IF(UnitsNo=2,\" in\"))&\" (Type 3)\"","v":"Luchtverhitter height 0 cm width 0 cm length 0 cm (Type 3)"}]
[]
[]
[]
[]
[]
[null,{"$f":"cal!$X$1&\" \"&$T$16&\" \"&ROUND(cal!X40,1)&IF(UnitsNo=1,\" cm\",IF(UnitsNo=2,\" in\"))& \" \"&$T$17&\" \"&ROUND(cal!Z40,1)&IF(UnitsNo=1,\" cm\",IF(UnitsNo=2,\" in\"))&\" \"&$T$18&\" \"&ROUND(cal!AB40,1)&IF(UnitsNo=1,\" cm\",IF(UnitsNo=2,\" in\"))&\" (Type 4)\"","v":"Luchtverhitter height 0 cm width 0 cm length 0 cm (Type 4)"}]
[]
[]
[]
[]
[]
[null,"*Sound power according to ISO 3741:2010",{"$nulls":11},{"$f":"cal!P46","v":"v2025-07-25"}]
[null,"**Sound pressure with an assumed room damping of 16 dB(A)"]

{"sheet":"DE","index":4,"n_rows":41,"n_cols":20,"rows_kept":41,"hidden":true,"merged":[[3,7,3,10],[4,7,4,10],[8,1,8,3],[8,6,8,9],[8,12,8,13],[9,1,9,3],[9,6,9,9],[10,1,10,3],[10,6,10,9],[15,1,15,13],[21,1,21,13],[27,1,27,13],[33,1,33,13]]}
[]
[]
[null,"Eingabefelder"]
[{"$nulls":7},"Hydraulikgemisch:"]
[null,"Auslegungsrandbedingungen",{"$nulls":5},"Gerät - Lüfter - Ausfürhung:",0,0,0]
[]
[null,"Temperaturen",{"$nulls":14},"Kopieren Sie alle daten"]
[null,"Heizen:",{"$nulls":4},"Kühlen:",{"$nulls":9},"SI-einheiten"]
[null,{"$f":"\"Vorlauf wasser\"","v":"Vorlauf wasser"},null,null,{"$f":"cal!E9","v":55},null,{"$f":"B9","v":"Vorlauf wasser"},{"$nulls":3},{"$f":"cal!K9","v":16},null,"Einheiten",{"$nulls":3},"Imperiale-einheiten"]
[null,{"$f":"\"Rücklauf wasser\"","v":"Rücklauf wasser"},null,null,{"$f":"cal!E10","v":45},null,{"$f":"B10","v":"Rücklauf wasser"},{"$nulls":3},{"$f":"cal!K10","v":{"v":18.22222222222222,"d":"18"}}]
[null,{"$f":"\"Raum\"","v":"Raum"},null,null,{"$f":"cal!E11","v":20},null,{"$f":"B11","v":"Raum"},{"$nulls":3},{"$f":"cal!K11","v":27}]
[{"$nulls":6},"Relative Luftfeuchtigkeit",{"$nulls":3},{"$f":"cal!K12","v":{"v":0.5,"d":"50%"}}]
[]
[]
[null,"Drehzahlstufe","Regelspannung [V]",{"$f":"CONCATENATE(\"Wärmeleistung  \",ROUND(E9,0),\"/\",ROUND(E10,0),\"/\",ROUND(E11,0),\" [\"&IF(cal!$W$4=1,\"kW\",IF(cal!$W$4=2,\"MBH\"))&\"]\")","v":"Wärmeleistung  55/45/20 [kW]"},{"$f":"\"Heizmittelstrom [\"&IF(cal!$W$4=1,\"l/h\",IF(cal!$W$4=2,\"GPM\"))&\"]\"","v":"Heizmittelstrom [l/h]"},{"$f":"\"zug. wassers. Druckverlust [\"&IF(cal!$W$4=1,\"kPa\",IF(cal!$W$4=2,\"inH2O\"))&\"]\"","v":"zug. wassers. Druckverlust [kPa]"},{"$f":"CONCATENATE(\"Sens. Kälteleistung  \",ROUND(K9,0),\"/\",ROUND(K10,0),\"/\",ROUND(K11,0),\" [\"&IF(cal!$W$4=1,\"kW\",IF(cal!$W$4=2,\"Btu/h\"))&\"]\")","v":"Sens. Kälteleistung  16/18/27 [kW]"},{"$f":"CONCATENATE(\"Tot. Kälteleistung \",ROUND(K9,0),\"/\",ROUND(K10,0),\"/\",ROUND(K11,0),\" [\"&IF(cal!$W$4=1,\"kW\",IF(cal!$W$4=2,\"Btu/h\"))&\"]\")","v":"Tot. Kälteleistung 16/18/27 [kW]"},{"$f":"\"Drehzahl [\"&IF(UnitsNo=1,\"u/min\",IF(UnitsNo=2,\"RPM\"))&\"]\"","v":"Drehzahl [u/min]"},{"$f":"\"zug. wassers. Druckverlust [\"&IF(cal!$W$4=1,\"kPa\",IF(cal!$W$4=2,\"inH2O\"))&\"]\"","v":"zug. wassers. Druckverlust [kPa]"},"Schalldruckpegel ** [dB(A)]","Schallleistungspegel * [dB(A)]","Leistungsaufnahme [W]",{"$f":"\"Luftvolumenstrom [\"&IF(cal!$W$4=1,\"m³/h\",IF(cal!$W$4=2,\"CFM\"))&\"]\"","v":"Luftvolumenstrom [m³/h]"},{"$f":"\"Luftaustrittstemp. Heizung  [\"&IF(cal!$W$4=1,\"°C\",IF(cal!$W$4=2,\"°F\"))&\"]\"","v":"Luftaustrittstemp. Heizung  [°C]"},{"$f":"\"Luftaustrittstemp. Kühlung  [\"&IF(cal!$W$4=1,\"°C\",IF(cal!$W$4=2,\"°F\"))&\"]\"","v":"Luftaustrittstemp. Kühlung  [°C]"}]
[null,{"$f":"cal!$X$1&\" \"&$T$16&\" \"&ROUND(cal!X22,1)&IF(UnitsNo=1,\" cm\",IF(UnitsNo=2,\" in\"))& \" \"&$T$17&\" \"&ROUND(cal!Z22,1)&IF(UnitsNo=1,\" cm\",IF(UnitsNo=2,\" in\"))&\" \"&$T$18&\" \"&ROUND(cal!AB22,1)&IF(UnitsNo=1,\" cm\",IF(UnitsNo=2,\" in\"))&\" (Type \"&cal!W16&\"\"&cal!AC22&\")\"","v":"Luchtverhitter höhe 41 cm breite 41 cm länge 43 cm (Type 021)"},{"$nulls":15},"Temp.",null,"höhe"]
[{"$nulls":17},"heizen!",null,"breite"]
[{"$nulls":17},"kühlen!",null,"länge"]
[]
[]
[]
[null,{"$f":"cal!$X$1&\" \"&$T$16&\" \"&ROUND(cal!X28,1)&IF(UnitsNo=1,\" cm\",IF(UnitsNo=2,\" in\"))& \" \"&$T$17&\" \"&ROUND(cal!Z28,1)&IF(UnitsNo=1,\" cm\",IF(UnitsNo=2,\" in\"))&\" \"&$T$18&\" \"&ROUND(cal!AB28,1)&IF(UnitsNo=1,\" cm\",IF(UnitsNo=2,\" in\"))&\" (Type \"&cal!W16&\"\"&cal!AC28&\")\"","v":"Luchtverhitter höhe 41 cm breite 41 cm länge 43 cm (Type 031)"}]
[]
[]
[]
[]
[]
[null,{"$f":"cal!$X$1&\" \"&$T$16&\" \"&ROUND(cal!X34,1)&IF(UnitsNo=1,\" cm\",IF(UnitsNo=2,\" in\"))& \" \"&$T$17&\" \"&ROUND(cal!Z34,1)&IF(UnitsNo=1,\" cm\",IF(UnitsNo=2,\" in\"))&\" \"&$T$18&\" \"&ROUND(cal!AB34,1)&IF(UnitsNo=1,\" cm\",IF(UnitsNo=2,\" in\"))&\" (Type 3)\"","v":"Luchtverhitter höhe 0 cm breite 0 cm länge 0 cm (Type 3)"}]
[]
[]
[]
[]
[]
[null,{"$f":"cal!$X$1&\" \"&$T$16&\" \"&ROUND(cal!X40,1)&IF(UnitsNo=1,\" cm\",IF(UnitsNo=2,\" in\"))& \" \"&$T$17&\" \"&ROUND(cal!Z40,1)&IF(UnitsNo=1,\" cm\",IF(UnitsNo=2,\" in\"))&\" \"&$T$18&\" \"&ROUND(cal!AB40,1)&IF(UnitsNo=1,\" cm\",IF(UnitsNo=2,\" in\"))&\" (Type 4)\"","v":"Luchtverhitter höhe 0 cm breite 0 cm länge 0 cm (Type 4)"}]
[]
[]
[]
[]
[]
[null,"*Schallleistungspegel nach ISO 3741:2010"]
[null,"**Schalldruckpegel bei angenommener Raumdämpfung von 16 dB(A)"]

{"sheet":"FR","index":5,"n_rows":41,"n_cols":20,"rows_kept":41,"hidden":true,"merged":[[3,7,3,10],[4,7,4,10],[8,1,8,3],[8,6,8,9],[8,12,8,13],[9,1,9,3],[9,6,9,9],[10,1,10,3],[10,6,10,9],[15,1,15,13],[21,1,21,13],[27,1,27,13],[33,1,33,13]]}
[]
[]
[null,"Formulaire"]
[{"$nulls":7},"Mélange hydraulique:"]
[null,"Conditions",{"$nulls":5},"Appareil - Ventilateur - Version:",0,0,0]
[]
[null,"Températures",{"$nulls":14},"Copier toutes des données"]
[null,"Chauffer:",{"$nulls":4},"Refroidir:",{"$nulls":9},"Unités-SI"]
[null,{"$f":"\"Entrée de l'eau\"","v":"Entrée de l'eau"},null,null,{"$f":"cal!E9","v":55},null,{"$f":"B9","v":"Entrée de l'eau"},{"$nulls":3},{"$f":"cal!K9","v":16},null,"Système unitaire",{"$nulls":3},"Unités-Impériales"]
[null,{"$f":"\"Retour de l'eau\"","v":"Retour de l'eau"},null,null,{"$f":"cal!E10","v":45},null,{"$f":"B10","v":"Retour de l'eau"},{"$nulls":3},{"$f":"cal!K10","v":{"v":18.22222222222222,"d":"18"}}]
[null,{"$f":"\"Ambiante\"","v":"Ambiante"},null,null,{"$f":"cal!E11","v":20},null,{"$f":"B11","v":"Ambiante"},{"$nulls":3},{"$f":"cal!K11","v":27}]
[{"$nulls":6},"Humidité relative",{"$nulls":3},{"$f":"cal!K12","v":{"v":0.5,"d":"50%"}}]
[]
[]
[null,"Niveau de vitesse","Voltage [V]",{"$f":"CONCATENATE(\"Puissance de cha.  \",ROUND(E9,0),\"/\",ROUND(E10,0),\"/\",ROUND(E11,0),\" [\"&IF(cal!$W$4=1,\"kW\",IF(cal!$W$4=2,\"MBH\"))&\"]\")","v":"Puissance de cha.  55/45/20 [kW]"},{"$f":"\"Débit d'eau, chauffer [\"&IF(cal!$W$4=1,\"l/h\",IF(cal!$W$4=2,\"GPM\"))&\"]\"","v":"Débit d'eau, chauffer [l/h]"},{"$f":"\"Perte de charge [\"&IF(cal!$W$4=1,\"kPa\",IF(cal!$W$4=2,\"inH2O\"))&\"]\"","v":"Perte de charge [kPa]"},{"$f":"CONCATENATE(\"Puissance sens. de refr.  \",ROUND(K9,0),\"/\",ROUND(K10,0),\"/\",ROUND(K11,0),\" [\"&IF(cal!$W$4=1,\"kW\",IF(cal!$W$4=2,\"Btu/h\"))&\"]\")","v":"Puissance sens. de refr.  16/18/27 [kW]"},{"$f":"CONCATENATE(\"Puissance tot. de refr. \",ROUND(K9,0),\"/\",ROUND(K10,0),\"/\",ROUND(K11,0),\" [\"&IF(cal!$W$4=1,\"kW\",IF(cal!$W$4=2,\"Btu/h\"))&\"]\")","v":"Puissance tot. de refr. 16/18/27 [kW]"},{"$f":"\"Vitesse [\"&IF(UnitsNo=1,\"u/min\",IF(UnitsNo=2,\"RPM\"))&\"]\"","v":"Vitesse [u/min]"},{"$f":"\"Perte de charge [\"&IF(cal!$W$4=1,\"kPa\",IF(cal!$W$4=2,\"inH2O\"))&\"]\"","v":"Perte de charge [kPa]"},"Pression sonore ** [dB(A)]","Puissance sonore * [dB(A)]","Puissance absorbée [W]",{"$f":"\"Débit d'air [\"&IF(cal!$W$4=1,\"m³/h\",IF(cal!$W$4=2,\"CFM\"))&\"]\"","v":"Débit d'air [m³/h]"},{"$f":"\"Temp. de la sortie d'air cha.  [\"&IF(cal!$W$4=1,\"°C\",IF(cal!$W$4=2,\"°F\"))&\"]\"","v":"Temp. de la sortie d'air cha.  [°C]"},{"$f":"\"Temp. de la sortie d'air refr.  [\"&IF(cal!$W$4=1,\"°C\",IF(cal!$W$4=2,\"°F\"))&\"]\"","v":"Temp. de la sortie d'air refr.  [°C]"}]
[null,{"$f":"cal!$X$1&\" \"&$T$16&\" \"&ROUND(cal!X22,1)&IF(UnitsNo=1,\" cm\",IF(UnitsNo=2,\" in\"))& \" \"&$T$17&\" \"&ROUND(cal!Z22,1)&IF(UnitsNo=1,\" cm\",IF(UnitsNo=2,\" in\"))&\" \"&$T$18&\" \"&ROUND(cal!AB22,1)&IF(UnitsNo=1,\" cm\",IF(UnitsNo=2,\" in\"))&\" (Type \"&cal!W16&\"\"&cal!AC22&\")\"","v":"Luchtverhitter hauteur 41 cm largeur 41 cm longueur 43 cm (Type 021)"},{"$nulls":15},"Temp.",null,"hauteur"]
[{"$nulls":17},"chauf.!",null,"largeur"]
[{"$nulls":17},"refr.!",null,"longueur"]
[]
[]
[]
[null,{"$f":"cal!$X$1&\" \"&$T$16&\" \"&ROUND(cal!X28,1)&IF(UnitsNo=1,\" cm\",IF(UnitsNo=2,\" in\"))& \" \"&$T$17&\" \"&ROUND(cal!Z28,1)&IF(UnitsNo=1,\" cm\",IF(UnitsNo=2,\" in\"))&\" \"&$T$18&\" \"&ROUND(cal!AB28,1)&IF(UnitsNo=1,\" cm\",IF(UnitsNo=2,\" in\"))&\" (Type \"&cal!W16&\"\"&cal!AC28&\")\"","v":"Luchtverhitter hauteur 41 cm largeur 41 cm longueur 43 cm (Type 031)"}]
[]
[]
[]
[]
[]
[null,{"$f":"cal!$X$1&\" \"&$T$16&\" \"&ROUND(cal!X34,1)&IF(UnitsNo=1,\" cm\",IF(UnitsNo=2,\" in\"))& \" \"&$T$17&\" \"&ROUND(cal!Z34,1)&IF(UnitsNo=1,\" cm\",IF(UnitsNo=2,\" in\"))&\" \"&$T$18&\" \"&ROUND(cal!AB34,1)&IF(UnitsNo=1,\" cm\",IF(UnitsNo=2,\" in\"))&\" (Type 3)\"","v":"Luchtverhitter hauteur 0 cm largeur 0 cm longueur 0 cm (Type 3)"}]
[]
[]
[]
[]
[]
[null,{"$f":"cal!$X$1&\" \"&$T$16&\" \"&ROUND(cal!X40,1)&IF(UnitsNo=1,\" cm\",IF(UnitsNo=2,\" in\"))& \" \"&$T$17&\" \"&ROUND(cal!Z40,1)&IF(UnitsNo=1,\" cm\",IF(UnitsNo=2,\" in\"))&\" \"&$T$18&\" \"&ROUND(cal!AB40,1)&IF(UnitsNo=1,\" cm\",IF(UnitsNo=2,\" in\"))&\" (Type 4)\"","v":"Luchtverhitter hauteur 0 cm largeur 0 cm longueur 0 cm (Type 4)"}]
[]
[]
[]
[]
[]
[null,"*Puissance sonore testé selon ISO 3741:2010",{"$nulls":11},{"$f":"cal!P46","v":"v2025-07-25"}]
[null,"**Pression sonore avec une atténuation ambiante du 16 dB(A)"]

{"sheet":"NR","index":6,"n_rows":41,"n_cols":20,"rows_kept":41,"hidden":true,"merged":[[3,7,3,10],[4,7,4,10],[8,1,8,3],[8,6,8,9],[8,12,8,13],[9,1,9,3],[9,6,9,9],[10,1,10,3],[10,6,10,9],[11,6,11,9],[15,1,15,13],[21,1,21,13],[27,1,27,13],[33,1,33,13]]}
[]
[]
[null,"Modell"]
[{"$nulls":7},"Væske blanding:",0,0,0]
[null,"Conditions",{"$nulls":5},"Modell:",0,0,0]
[]
[null,"Temperaturer",{"$nulls":14},"Kopier alle data"]
[null,"Varme:",{"$nulls":4},"Kjøling:",{"$nulls":9},"SI-enheter"]
[null,"Tur vann",0,0,{"$f":"cal!E9","v":55},null,{"$f":"B9","v":"Tur vann"},{"$nulls":3},{"$f":"cal!K9","v":16},null,"Enhetssystem",{"$nulls":3},"Imperiale-enheter"]
[null,"Retur vann",0,0,{"$f":"cal!E10","v":45},null,{"$f":"B10","v":"Retur vann"},{"$nulls":3},{"$f":"cal!K10","v":{"v":18.22222222222222,"d":"18"}}]
[null,"Rom",0,0,{"$f":"cal!E11","v":20},null,{"$f":"B11","v":"Rom"},{"$nulls":3},{"$f":"cal!K11","v":27}]
[{"$nulls":6},"Relativ fuktighet",{"$nulls":3},{"$f":"cal!K12","v":{"v":0.5,"d":"50%"}}]
[]
[]
[null,"Hastighet","Styresignal [V]",{"$f":"CONCATENATE(\"Varme effekt \",ROUND(E9,0),\"/\",ROUND(E10,0),\"/\",ROUND(E11,0),\" [\"&IF(cal!$W$4=1,\"kW\",IF(cal!$W$4=2,\"MBH\"))&\"]\")","v":"Varme effekt 55/45/20 [kW]"},{"$f":"\"Vannmengde, varme [\"&IF(cal!$W$4=1,\"l/h\",IF(cal!$W$4=2,\"GPM\"))&\"]\"","v":"Vannmengde, varme [l/h]"},{"$f":"\"Trykktap [\"&IF(cal!$W$4=1,\"kPa\",IF(cal!$W$4=2,\"ftH2O\"))&\"]\"","v":"Trykktap [kPa]"},{"$f":"CONCATENATE(\"Sens. Kjøling effekt * \",ROUND(K9,0),\"/\",ROUND(K10,0),\"/\",ROUND(K11,0),\" [\"&IF(cal!$W$4=1,\"kW\",IF(cal!$W$4=2,\"Btu/h\"))&\"]\")","v":"Sens. Kjøling effekt * 16/18/27 [kW]"},{"$f":"CONCATENATE(\"Tot. Kjøle effekt \",ROUND(K9,0),\"/\",ROUND(K10,0),\"/\",ROUND(K11,0),\" [\"&IF(cal!$W$4=1,\"kW\",IF(cal!$W$4=2,\"Btu/h\"))&\"]\")","v":"Tot. Kjøle effekt 16/18/27 [kW]"},{"$f":"\"hastighet  [\"&IF(UnitsNo=1,\"u/min\",IF(UnitsNo=2,\"RPM\"))&\"]\"","v":"hastighet  [u/min]"},{"$f":"F15","v":"Trykktap [kPa]"},"Lydtrykk ** [dB(A)]","Lydeffekt * [dB(A)]","Elektrisk effekt [W]",{"$f":"\"Luftmengde [\"&IF(cal!$W$4=1,\"m³/h\",IF(cal!$W$4=2,\"CFM\"))&\"]\"","v":"Luftmengde [m³/h]"},{"$f":"\"Uitblaastemp. verwarming  [\"&IF(cal!$W$4=1,\"°C\",IF(cal!$W$4=2,\"°F\"))&\"]\"","v":"Uitblaastemp. verwarming  [°C]"},{"$f":"\"Uitblaastemp. koeling  [\"&IF(cal!$W$4=1,\"°C\",IF(cal!$W$4=2,\"°F\"))&\"]\"","v":"Uitblaastemp. koeling  [°C]"}]
[null,{"$f":"cal!$X$1&\" \"&$T$16&\" \"&ROUND(cal!X22,1)&IF(UnitsNo=1,\" cm\",IF(UnitsNo=2,\" in\"))& \" \"&$T$17&\" \"&ROUND(cal!Z22,1)&IF(UnitsNo=1,\" cm\",IF(UnitsNo=2,\" in\"))&\" \"&$T$18&\" \"&ROUND(cal!AB22,1)&IF(UnitsNo=1,\" cm\",IF(UnitsNo=2,\" in\"))&\" (Type \"&cal!W16&\"\"&cal!AC22&\")\"","v":"Luchtverhitter høyde 41 cm bredde 41 cm lengde 43 cm (Type 021)"},{"$nulls":15},"Temp.",null,"høyde"]
[{"$nulls":17},"varme!",null,"bredde"]
[{"$nulls":17},"kjøling!",null,"lengde"]
[]
[]
[]
[null,{"$f":"cal!$X$1&\" \"&$T$16&\" \"&ROUND(cal!X28,1)&IF(UnitsNo=1,\" cm\",IF(UnitsNo=2,\" in\"))& \" \"&$T$17&\" \"&ROUND(cal!Z28,1)&IF(UnitsNo=1,\" cm\",IF(UnitsNo=2,\" in\"))&\" \"&$T$18&\" \"&ROUND(cal!AB28,1)&IF(UnitsNo=1,\" cm\",IF(UnitsNo=2,\" in\"))&\" (Type \"&cal!W16&\"\"&cal!AC28&\")\"","v":"Luchtverhitter høyde 41 cm bredde 41 cm lengde 43 cm (Type 031)"}]
[]
[]
[]
[]
[]
[null,{"$f":"cal!$X$1&\" \"&$T$16&\" \"&ROUND(cal!X34,1)&IF(UnitsNo=1,\" cm\",IF(UnitsNo=2,\" in\"))& \" \"&$T$17&\" \"&ROUND(cal!Z34,1)&IF(UnitsNo=1,\" cm\",IF(UnitsNo=2,\" in\"))&\" \"&$T$18&\" \"&ROUND(cal!AB34,1)&IF(UnitsNo=1,\" cm\",IF(UnitsNo=2,\" in\"))&\" (Type 3)\"","v":"Luchtverhitter høyde 0 cm bredde 0 cm lengde 0 cm (Type 3)"}]
[]
[]
[]
[]
[]
[null,{"$f":"cal!$X$1&\" \"&$T$16&\" \"&ROUND(cal!X40,1)&IF(UnitsNo=1,\" cm\",IF(UnitsNo=2,\" in\"))& \" \"&$T$17&\" \"&ROUND(cal!Z40,1)&IF(UnitsNo=1,\" cm\",IF(UnitsNo=2,\" in\"))&\" \"&$T$18&\" \"&ROUND(cal!AB40,1)&IF(UnitsNo=1,\" cm\",IF(UnitsNo=2,\" in\"))&\" (Type 4)\"","v":"Luchtverhitter høyde 0 cm bredde 0 cm lengde 0 cm (Type 4)"}]
[]
[]
[]
[]
[]
[null,"**Sound power according to ISO 3741:2010",{"$nulls":11},{"$f":"cal!P46","v":"v2025-07-25"}]
[null,"***Sound pressure with an assumed room damping of 16 dB(A)"]

{"sheet":"SP","index":7,"n_rows":41,"n_cols":20,"rows_kept":41,"hidden":true,"merged":[[3,7,3,10],[4,7,4,10],[8,1,8,3],[8,6,8,9],[8,12,8,13],[9,1,9,3],[9,6,9,9],[10,1,10,3],[10,6,10,9],[11,6,11,9],[15,1,15,13],[21,1,21,13],[27,1,27,13],[33,1,33,13]]}
[]
[]
[]
[]
[]
[]
[null,"Temperaturas",{"$nulls":14},"Copiar todos los datos"]
[null,"Calefacción:",{"$nulls":4},"Enfriamiento:",{"$nulls":9},"Unidades-SI"]
[null,"Agua impulsión",0,0,{"$f":"cal!E9","v":55},null,{"$f":"B9","v":"Agua impulsión"},{"$nulls":3},{"$f":"cal!K9","v":16},null,"Convers. de unidades",{"$nulls":3},"Unidades-Imperial"]
[null,"Agua retorno",0,0,{"$f":"cal!E10","v":45},null,{"$f":"B10","v":"Agua retorno"},{"$nulls":3},{"$f":"cal!K10","v":{"v":18.22222222222222,"d":"18"}}]
[null,"Ambiente",0,0,{"$f":"cal!E11","v":20},null,{"$f":"B11","v":"Ambiente"},{"$nulls":3},{"$f":"cal!K11","v":27}]
[{"$nulls":6},"Humedad relativa",{"$nulls":3},{"$f":"cal!K12","v":{"v":0.5,"d":"50%"}}]
[]
[]
[null,"Nivel de velocidad"," Voltaje control [V]",{"$f":"CONCATENATE(\"Emisión calefacción \",ROUND(E9,0),\"/\",ROUND(E10,0),\"/\",ROUND(E11,0),\" [\"&IF(UnitsNo=1,\"kW\",IF(UnitsNo=2,\"MBH\"))&\"]\")","v":"Emisión calefacción 55/45/20 [kW]"},{"$f":"\"Caudal de agua, calefacción [\"&IF(1=1,\"l/h\",IF(UnitsNo=2,\"GPM\"))&\"]\"","v":"Caudal de agua, calefacción [l/h]"},{"$f":"\"Pérdida de carga del agua [\"&IF(UnitsNo=1,\"kPa\",IF(UnitsNo=2,\"ftH2O\"))&\"]\"","v":"Pérdida de carga del agua [kPa]"},{"$f":"CONCATENATE(\"Emisión sensible Frío * \",ROUND(K9,0),\"/\",ROUND(K10,0),\"/\",ROUND(K11,0),\" [\"&IF(UnitsNo=1,\"kW\",IF(UnitsNo=2,\"Btu/h\"))&\"]\")","v":"Emisión sensible Frío * 16/18/27 [kW]"},{"$f":"CONCATENATE(\"Emisión total Frío \",ROUND(K9,0),\"/\",ROUND(K10,0),\"/\",ROUND(K11,0),\" [\"&IF(UnitsNo=1,\"kW\",IF(UnitsNo=2,\"Btu/h\"))&\"]\")","v":"Emisión total Frío 16/18/27 [kW]"},{"$f":"\"Velocidad  [\"&IF(UnitsNo=1,\"u/min\",IF(UnitsNo=2,\"RPM\"))&\"]\"","v":"Velocidad  [u/min]"},{"$f":"F15","v":"Pérdida de carga del agua [kPa]"},"Presión sonora ** [dB(A)]","Potencia sonora * [dB(A)]","Potencia eléctrica absorbida [W]",{"$f":"\"Caudal de aire [\"&IF(UnitsNo=1,\"m³/h\",IF(UnitsNo=2,\"CFM\"))&\"]\"","v":"Caudal de aire [m³/h]"},{"$f":"\"Temperatura salida de aire calefacción [\"&IF(UnitsNo=1,\"°C\",IF(UnitsNo=2,\"°F\"))&\"]\"","v":"Temperatura salida de aire calefacción [°C]"},{"$f":"\"Temperatura salida de aire refrigeración (bulbo seco) [\"&IF(UnitsNo=1,\"°C\",IF(UnitsNo=2,\"°F\"))&\"]\"","v":"Temperatura salida de aire refrigeración (bulbo seco) [°C]"}]
[null,{"$f":"cal!$X$1&\" \"&$T$16&\" \"&ROUND(cal!X22,1)&IF(UnitsNo=1,\" cm\",IF(UnitsNo=2,\" in\"))& \" \"&$T$17&\" \"&ROUND(cal!Z22,1)&IF(UnitsNo=1,\" cm\",IF(UnitsNo=2,\" in\"))&\" \"&$T$18&\" \"&ROUND(cal!AB22,1)&IF(UnitsNo=1,\" cm\",IF(UnitsNo=2,\" in\"))&\" (Type \"&cal!W16&\"\"&cal!AC22&\")\"","v":"Luchtverhitter altura 41 cm ancho 41 cm longitud 43 cm (Type 021)"},{"$nulls":15},"Temp.",null,"altura"]
[{"$nulls":17},"calefac.",null,"ancho"]
[{"$nulls":17},"enfria.",null,"longitud"]
[]
[]
[]
[null,{"$f":"cal!$X$1&\" \"&$T$16&\" \"&ROUND(cal!X28,1)&IF(UnitsNo=1,\" cm\",IF(UnitsNo=2,\" in\"))& \" \"&$T$17&\" \"&ROUND(cal!Z28,1)&IF(UnitsNo=1,\" cm\",IF(UnitsNo=2,\" in\"))&\" \"&$T$18&\" \"&ROUND(cal!AB28,1)&IF(UnitsNo=1,\" cm\",IF(UnitsNo=2,\" in\"))&\" (Type \"&cal!W16&\"\"&cal!AC28&\")\"","v":"Luchtverhitter altura 41 cm ancho 41 cm longitud 43 cm (Type 031)"}]
[]
[]
[]
[]
[]
[null,{"$f":"cal!$X$1&\" \"&$T$16&\" \"&ROUND(cal!X34,1)&IF(UnitsNo=1,\" cm\",IF(UnitsNo=2,\" in\"))& \" \"&$T$17&\" \"&ROUND(cal!Z34,1)&IF(UnitsNo=1,\" cm\",IF(UnitsNo=2,\" in\"))&\" \"&$T$18&\" \"&ROUND(cal!AB34,1)&IF(UnitsNo=1,\" cm\",IF(UnitsNo=2,\" in\"))&\" (Type 3)\"","v":"Luchtverhitter altura 0 cm ancho 0 cm longitud 0 cm (Type 3)"}]
[]
[]
[]
[]
[]
[null,{"$f":"cal!$X$1&\" \"&$T$16&\" \"&ROUND(cal!X40,1)&IF(UnitsNo=1,\" cm\",IF(UnitsNo=2,\" in\"))& \" \"&$T$17&\" \"&ROUND(cal!Z40,1)&IF(UnitsNo=1,\" cm\",IF(UnitsNo=2,\" in\"))&\" \"&$T$18&\" \"&ROUND(cal!AB40,1)&IF(UnitsNo=1,\" cm\",IF(UnitsNo=2,\" in\"))&\" (Type 4)\"","v":"Luchtverhitter altura 0 cm ancho 0 cm longitud 0 cm (Type 4)"}]
[]
[]
[]
[]
[]
[null,"**Potencia sonora de acuerdo a ISO 3741:2010",{"$nulls":11},{"$f":"cal!P46","v":"v2025-07-25"}]
[null,"***Presión sonora asumiendo una reducción de la estancia de  16 dB(A)"]

{"sheet":"SW","index":8,"n_rows":41,"n_cols":20,"rows_kept":41,"hidden":true,"merged":[[3,7,3,10],[4,7,4,10],[8,1,8,3],[8,6,8,9],[8,12,8,13],[9,1,9,3],[9,6,9,9],[10,6,10,9],[15,1,15,13],[21,1,21,13],[27,1,27,13],[33,1,33,13]]}
[]
[]
[null,"Formulary"]
[{"$nulls":7},"Hydraulic mix:",0,0,0]
[null,"Conditions",{"$nulls":5},"Device - Ventilator - Utilization:",0,0,0]
[]
[null,"Temperaturer",{"$nulls":14},"Kopiera all data"]
[null,"Värme:",{"$nulls":4},"Kyla:",{"$nulls":9},"SI-enheter"]
[null,"Tillopp",null,null,{"$f":"cal!E9","v":55},null,{"$f":"B9","v":"Tillopp"},{"$nulls":3},{"$f":"cal!K9","v":16},null,"Enhetssystem",{"$nulls":3},"Imperiella-enheter"]
[null,"Retur",null,null,{"$f":"cal!E10","v":45},null,{"$f":"B10","v":"Retur"},{"$nulls":3},{"$f":"cal!K10","v":{"v":18.22222222222222,"d":"18"}}]
[null,"Rum (torr)",null,null,{"$f":"cal!E11","v":20},null,{"$f":"B11","v":"Rum (torr)"},{"$nulls":3},{"$f":"cal!K11","v":27}]
[{"$nulls":6},"rel. Fuktighet",{"$nulls":3},{"$f":"cal!K12","v":{"v":0.5,"d":"50%"}}]
[]
[]
[null,"Fläkthastighet","Spänning, Fläkt [V]",{"$f":"CONCATENATE(\"Värme effekt  \",ROUND(E9,0),\"/\",ROUND(E10,0),\"/\",ROUND(E11,0),\" [\"&IF(cal!$W$4=1,\"kW\",IF(cal!$W$4=2,\"MBH\"))&\"]\")","v":"Värme effekt  55/45/20 [kW]"},{"$f":"\"Vattenflöde, värme [\"&IF(cal!$W$4=1,\"l/h\",IF(cal!$W$4=2,\"GPM\"))&\"]\"","v":"Vattenflöde, värme [l/h]"},{"$f":"\"Tryckfall, vatten [\"&IF(cal!$W$4=1,\"kPa\",IF(cal!$W$4=2,\"inH2O\"))&\"]\"","v":"Tryckfall, vatten [kPa]"},{"$f":"CONCATENATE(\"Märkbar kylkapacitet  \",ROUND(K9,0),\"/\",ROUND(K10,0),\"/\",ROUND(K11,0),\" [\"&IF(cal!$W$4=1,\"kW\",IF(cal!$W$4=2,\"Btu/h\"))&\"]\")","v":"Märkbar kylkapacitet  16/18/27 [kW]"},{"$f":"CONCATENATE(\"Total kylkapacitet \",ROUND(K9,0),\"/\",ROUND(K10,0),\"/\",ROUND(K11,0),\" [\"&IF(cal!$W$4=1,\"kW\",IF(cal!$W$4=2,\"Btu/h\"))&\"]\")","v":"Total kylkapacitet 16/18/27 [kW]"},{"$f":"\"Hastighet  [\"&IF(UnitsNo=1,\"u/min\",IF(UnitsNo=2,\"RPM\"))&\"]\"","v":"Hastighet  [u/min]"},{"$f":"F15","v":"Tryckfall, vatten [kPa]"},"Ljudtryck ** [dB(A)]","Ljudeffekt * [dB(A)]","Effektförbrukning [W]",{"$f":"\"Luftflöde [\"&IF(cal!$W$4=1,\"m³/h\",IF(cal!$W$4=2,\"CFM\"))&\"]\"","v":"Luftflöde [m³/h]"},{"$f":"\"Luftavgassystemets värming  [\"&IF(cal!$W$4=1,\"°C\",IF(cal!$W$4=2,\"°F\"))&\"]\"","v":"Luftavgassystemets värming  [°C]"},{"$f":"\"Luftavgassystemets kylning  [\"&IF(cal!$W$4=1,\"°C\",IF(cal!$W$4=2,\"°F\"))&\"]\"","v":"Luftavgassystemets kylning  [°C]"}]
[null,{"$f":"cal!$X$1&\" \"&$T$16&\" \"&ROUND(cal!X22,1)&IF(UnitsNo=1,\" cm\",IF(UnitsNo=2,\" in\"))& \" \"&$T$17&\" \"&ROUND(cal!Z22,1)&IF(UnitsNo=1,\" cm\",IF(UnitsNo=2,\" in\"))&\" \"&$T$18&\" \"&ROUND(cal!AB22,1)&IF(UnitsNo=1,\" cm\",IF(UnitsNo=2,\" in\"))&\" (Typ \"&cal!W16&\"\"&cal!AC22&\")\"","v":"Luchtverhitter höjd 41 cm djup 41 cm längd 43 cm (Typ 021)"},{"$nulls":15},"Temp.",null,"höjd"]
[{"$nulls":17},"värme!",null,"djup"]
[{"$nulls":17},"kyla!",null,"längd"]
[]
[]
[]
[null,{"$f":"cal!$X$1&\" \"&$T$16&\" \"&ROUND(cal!X28,1)&IF(UnitsNo=1,\" cm\",IF(UnitsNo=2,\" in\"))& \" \"&$T$17&\" \"&ROUND(cal!Z28,1)&IF(UnitsNo=1,\" cm\",IF(UnitsNo=2,\" in\"))&\" \"&$T$18&\" \"&ROUND(cal!AB28,1)&IF(UnitsNo=1,\" cm\",IF(UnitsNo=2,\" in\"))&\" (Typ \"&cal!W16&\"\"&cal!AC28&\")\"","v":"Luchtverhitter höjd 41 cm djup 41 cm längd 43 cm (Typ 031)"}]
[]
[]
[]
[]
[]
[null,{"$f":"cal!$X$1&\" \"&$T$16&\" \"&ROUND(cal!X34,1)&IF(UnitsNo=1,\" cm\",IF(UnitsNo=2,\" in\"))& \" \"&$T$17&\" \"&ROUND(cal!Z34,1)&IF(UnitsNo=1,\" cm\",IF(UnitsNo=2,\" in\"))&\" \"&$T$18&\" \"&ROUND(cal!AB34,1)&IF(UnitsNo=1,\" cm\",IF(UnitsNo=2,\" in\"))&\" (Typ 3)\"","v":"Luchtverhitter höjd 0 cm djup 0 cm längd 0 cm (Typ 3)"}]
[]
[]
[]
[]
[]
[null,{"$f":"cal!$X$1&\" \"&$T$16&\" \"&ROUND(cal!X40,1)&IF(UnitsNo=1,\" cm\",IF(UnitsNo=2,\" in\"))& \" \"&$T$17&\" \"&ROUND(cal!Z40,1)&IF(UnitsNo=1,\" cm\",IF(UnitsNo=2,\" in\"))&\" \"&$T$18&\" \"&ROUND(cal!AB40,1)&IF(UnitsNo=1,\" cm\",IF(UnitsNo=2,\" in\"))&\" (Typ 4)\"","v":"Luchtverhitter höjd 0 cm djup 0 cm längd 0 cm (Typ 4)"}]
[]
[]
[]
[]
[]
[null,"*Ljudeffekt enligt ISO 3741: 2010",{"$nulls":11},{"$f":"cal!P46","v":"v2025-07-25"}]
[null,"**Ljudtryck med en antagen rumsdämpning på 16 dB (A)"]

{"sheet":"TS","index":9,"n_rows":41,"n_cols":20,"rows_kept":41,"hidden":true,"merged":[[3,7,3,10],[4,7,4,10],[8,1,8,3],[8,6,8,9],[8,12,8,13],[9,1,9,3],[9,6,9,9],[10,1,10,3],[10,6,10,9],[15,1,15,13],[21,1,21,13],[27,1,27,13],[33,1,33,13]]}
[]
[]
[null,"Invulformulier"]
[{"$nulls":7},"Směs vody:",0,0,0]
[null,"Randvoorwaarden",{"$nulls":5},"Těleso - Ventilátor - Verze:",0,0,0]
[]
[null,"Teploty",{"$nulls":14},"Kopírovat všechna data"]
[null,"Topení:",{"$nulls":4},"Chlazení:",{"$nulls":9},"Mezinárodní (Sl)"]
[null,{"$f":"\"Voda na přívodu\"","v":"Voda na přívodu"},null,null,{"$f":"cal!E9","v":55},null,{"$f":"B9","v":"Voda na přívodu"},{"$nulls":3},{"$f":"cal!K9","v":16},null,"Převod jednotek",{"$nulls":3},"Imperiální"]
[null,{"$f":"\"Voda na zpátečce\"","v":"Voda na zpátečce"},null,null,{"$f":"cal!E10","v":45},null,{"$f":"B10","v":"Voda na zpátečce"},{"$nulls":3},{"$f":"cal!K10","v":{"v":18.22222222222222,"d":"18"}}]
[null,"\"Suchá\" teplota vzduchu",null,null,{"$f":"cal!E11","v":20},null,{"$f":"B11","v":"\"Suchá\" teplota vzduchu"},{"$nulls":3},{"$f":"cal!K11","v":27}]
[{"$nulls":6},"Relativní vlhkost",{"$nulls":3},{"$f":"cal!K12","v":{"v":0.5,"d":"50%"}}]
[]
[]
[null,"Rychlost","Ovládací napětí [V]",{"$f":"CONCATENATE(\"Výkon Topení  \",ROUND(E9,0),\"/\",ROUND(E10,0),\"/\",ROUND(E11,0),\" [\"&IF(UnitsNo=1,\"kW\",IF(UnitsNo=2,\"MBH\"))&\"]\")","v":"Výkon Topení  55/45/20 [kW]"},{"$f":"\"Průtok vody, topení [\"&IF(UnitsNo=1,\"l/h\",IF(UnitsNo=2,\"GPM\"))&\"]\"","v":"Průtok vody, topení [l/h]"},{"$f":"\"Tlaková ztráta [\"&IF(UnitsNo=1,\"kPa\",IF(UnitsNo=2,\"inH2O\"))&\"]\"","v":"Tlaková ztráta [kPa]"},{"$f":"CONCATENATE(\"Výkon chlazení Znatelný  \",ROUND(K9,0),\"/\",,ROUND(K10,0),\"/\",,ROUND(K11,0),\" [\"&IF(UnitsNo=1,\"kW\",IF(UnitsNo=2,\"Btu/h\"))&\"]\")","v":"Výkon chlazení Znatelný  16/18/27 [kW]"},{"$f":"CONCATENATE(\"Výkon chlazení Celkový \",,ROUND(K9,0),\"/\",,ROUND(K10,0),\"/\",,ROUND(K11,0),\" [\"&IF(UnitsNo=1,\"kW\",IF(UnitsNo=2,\"Btu/h\"))&\"]\")","v":"Výkon chlazení Celkový 16/18/27 [kW]"},{"$f":"\"Rychlost [\"&IF(UnitsNo=1,\"u/min\",IF(UnitsNo=2,\"RPM\"))&\"]\"","v":"Rychlost [u/min]"},{"$f":"F15","v":"Tlaková ztráta [kPa]"},"Akustický tlak ** [dB(A)]","Akustický výkon * [dB(A)]","Elektrický výkon [W]",{"$f":"\"Průtok vzduchu [\"&IF(UnitsNo=1,\"m³/h\",IF(UnitsNo=2,\"CFM\"))&\"]\"","v":"Průtok vzduchu [m³/h]"},{"$f":"\"Výfuková teplota vzduchu top. [\"&IF(UnitsNo=1,\"°C\",IF(UnitsNo=2,\"°F\"))&\"]\"","v":"Výfuková teplota vzduchu top. [°C]"},{"$f":"\"Výfuková teplota vzduchu chlaz.  [\"&IF(UnitsNo=1,\"°C\",IF(UnitsNo=2,\"°F\"))&\"]\"","v":"Výfuková teplota vzduchu chlaz.  [°C]"}]
[null,{"$f":"cal!$X$1&\" \"&$T$16&\", \"&ROUND(cal!X22,1)&IF(UnitsNo=1,\" cm\",IF(UnitsNo=2,\" in\"))& \", \"&$T$17&\" \"&ROUND(cal!Z22,1)&IF(UnitsNo=1,\" cm\",IF(UnitsNo=2,\" in\"))&\", \"&$T$18&\" \"&ROUND(cal!AB22,1)&IF(UnitsNo=1,\" cm\",IF(UnitsNo=2,\" in\"))&\" (Typ \"&cal!W16&\"\"&cal!AC22&\")\"","v":"Luchtverhitter Výška, 41 cm, Šířka 41 cm, Délka 43 cm (Typ 021)"},{"$nulls":15},"Teploty",null,"Výška"]
[{"$nulls":17},"topení!",null,"Šířka"]
[{"$nulls":17},"chlazení!",null,"Délka"]
[]
[]
[]
[null,{"$f":"cal!$X$1&\" \"&$T$16&\" \"&ROUND(cal!X28,1)&IF(UnitsNo=1,\" cm\",IF(UnitsNo=2,\" in\"))& \" \"&$T$17&\" \"&ROUND(cal!Z28,1)&IF(UnitsNo=1,\" cm\",IF(UnitsNo=2,\" in\"))&\" \"&$T$18&\" \"&ROUND(cal!AB28,1)&IF(UnitsNo=1,\" cm\",IF(UnitsNo=2,\" in\"))&\" (Typ \"&cal!W16&\"\"&cal!AC28&\")\"","v":"Luchtverhitter Výška 41 cm Šířka 41 cm Délka 43 cm (Typ 031)"}]
[]
[]
[]
[]
[]
[null,{"$f":"cal!$X$1&\" \"&$T$16&\" \"&ROUND(cal!X34,1)&IF(UnitsNo=1,\" cm\",IF(UnitsNo=2,\" in\"))& \" \"&$T$17&\" \"&ROUND(cal!Z34,1)&IF(UnitsNo=1,\" cm\",IF(UnitsNo=2,\" in\"))&\" \"&$T$18&\" \"&ROUND(cal!AB34,1)&IF(UnitsNo=1,\" cm\",IF(UnitsNo=2,\" in\"))&\" (Typ 3)\"","v":"Luchtverhitter Výška 0 cm Šířka 0 cm Délka 0 cm (Typ 3)"}]
[]
[]
[]
[]
[]
[null,{"$f":"cal!$X$1&\" \"&$T$16&\" \"&ROUND(cal!X40,1)&IF(UnitsNo=1,\" cm\",IF(UnitsNo=2,\" in\"))& \" \"&$T$17&\" \"&ROUND(cal!Z40,1)&IF(UnitsNo=1,\" cm\",IF(UnitsNo=2,\" in\"))&\" \"&$T$18&\" \"&ROUND(cal!AB40,1)&IF(UnitsNo=1,\" cm\",IF(UnitsNo=2,\" in\"))&\" (Typ 4)\"","v":"Luchtverhitter Výška 0 cm Šířka 0 cm Délka 0 cm (Typ 4)"}]
[]
[]
[]
[]
[]
[null,"*Akustický tlak podle ISO 3741:2010 ",{"$nulls":11},{"$f":"cal!P46","v":"v2025-07-25"}]
[null,"**Akustický výkon s předpokládaným útlumem místnosti 16 dB (A)."]

{"sheet":"ExtraTaal1","index":10,"n_rows":41,"n_cols":20,"rows_kept":41,"hidden":true,"merged":[[3,7,3,10],[4,7,4,10],[8,1,8,3],[8,6,8,9],[8,12,8,13],[9,1,9,3],[9,6,9,9],[10,6,10,9],[15,1,15,13],[21,1,21,13],[27,1,27,13],[33,1,33,13]]}
[]
[]
[null,"Formulary"]
[{"$nulls":7},"Hydraulic mix:",0,0,0]
[null,"Conditions",{"$nulls":5},"Device - Ventilator - Utilization:",0,0,0]
[]
[null,"Temperatures",{"$nulls":14},"Copy all data"]
[null,"Heating:",{"$nulls":4},"Cooling:",{"$nulls":9},"SI-units"]
[null,"Supply water",null,null,{"$f":"cal!E9","v":55},null,{"$f":"B9","v":"Supply water"},{"$nulls":3},{"$f":"cal!K9","v":16},null,"Unit conversion",{"$nulls":3},"Imperial-units"]
[null,"Return water",null,null,{"$f":"cal!E10","v":45},null,{"$f":"B10","v":"Return water"},{"$nulls":3},{"$f":"cal!K10","v":{"v":18.22222222222222,"d":"18"}}]
[null,"Entering air",null,null,{"$f":"cal!E11","v":20},null,{"$f":"B11","v":"Entering air"},{"$nulls":3},{"$f":"cal!K11","v":27}]
[{"$nulls":6},"Relative humidity",{"$nulls":3},{"$f":"cal!K12","v":{"v":0.5,"d":"50%"}}]
[]
[]
[null,"Speed level","Control voltage [V]",{"$f":"CONCATENATE(\"Heat output  \",ROUND(E9,0),\"/\",ROUND(E10,0),\"/\",ROUND(E11,0),\" [\"&IF(cal!$W$4=1,\"W\",IF(cal!$W$4=2,\"Btu/h\"))&\"]\")","v":"Heat output  55/45/20 [W]"},{"$f":"\"Water flowrate, heating [\"&IF(cal!$W$4=1,\"l/h\",IF(cal!$W$4=2,\"GPM\"))&\"]\"","v":"Water flowrate, heating [l/h]"},{"$f":"\"Watersided pressure loss [\"&IF(cal!$W$4=1,\"kPa\",IF(cal!$W$4=2,\"inH2O\"))&\"]\"","v":"Watersided pressure loss [kPa]"},{"$f":"CONCATENATE(\"Sens. cooling capacity  \",ROUND(K9,0),\"/\",ROUND(K10,0),\"/\",ROUND(K11,0),\" [\"&IF(cal!$W$4=1,\"W\",IF(cal!$W$4=2,\"Btu/h\"))&\"]\")","v":"Sens. cooling capacity  16/18/27 [W]"},{"$f":"CONCATENATE(\"Tot. cooling capacity \",ROUND(K9,0),\"/\",ROUND(K10,0),\"/\",ROUND(K11,0),\" [\"&IF(cal!$W$4=1,\"W\",IF(cal!$W$4=2,\"Btu/h\"))&\"]\")","v":"Tot. cooling capacity 16/18/27 [W]"},{"$f":"\"Water flowrate, cooling [\"&IF(cal!$W$4=1,\"l/h\",IF(cal!$W$4=2,\"GPM\"))&\"]\"","v":"Water flowrate, cooling [l/h]"},{"$f":"\"Watersided pressure loss [\"&IF(cal!$W$4=1,\"kPa\",IF(cal!$W$4=2,\"inH2O\"))&\"]\"","v":"Watersided pressure loss [kPa]"},"Sound pressure ** [dB(A)]","Sound power * [dB(A)]","Electrical power [W]",{"$f":"\"Air flowrate [\"&IF(cal!$W$4=1,\"m³/h\",IF(cal!$W$4=2,\"CFM\"))&\"]\"","v":"Air flowrate [m³/h]"},{"$f":"\"Air exhaust temp. heating  [\"&IF(cal!$W$4=1,\"°C\",IF(cal!$W$4=2,\"°F\"))&\"]\"","v":"Air exhaust temp. heating  [°C]"},{"$f":"\"Air exhaust temp. cooling  [\"&IF(cal!$W$4=1,\"°C\",IF(cal!$W$4=2,\"°F\"))&\"]\"","v":"Air exhaust temp. cooling  [°C]"}]
[null,{"$f":"cal!$X$1&\" \"&$T$16&\" \"&ROUND(cal!X22,1)&IF(UnitsNo=1,\" cm\",IF(UnitsNo=2,\" in\"))& \" \"&$T$17&\" \"&ROUND(cal!Z22,1)&IF(UnitsNo=1,\" cm\",IF(UnitsNo=2,\" in\"))&\" \"&$T$18&\" \"&ROUND(cal!AB22,1)&IF(UnitsNo=1,\" cm\",IF(UnitsNo=2,\" in\"))&\" (Type 1)\"","v":"Luchtverhitter height 41 cm width 41 cm length 43 cm (Type 1)"},{"$nulls":15},"Temp.",null,"height"]
[{"$nulls":17},"heating!",null,"width"]
[{"$nulls":17},"cooling!",null,"length"]
[]
[]
[]
[null,{"$f":"cal!$X$1&\" \"&$T$16&\" \"&ROUND(cal!X28,1)&IF(UnitsNo=1,\" cm\",IF(UnitsNo=2,\" in\"))& \" \"&$T$17&\" \"&ROUND(cal!Z28,1)&IF(UnitsNo=1,\" cm\",IF(UnitsNo=2,\" in\"))&\" \"&$T$18&\" \"&ROUND(cal!AB28,1)&IF(UnitsNo=1,\" cm\",IF(UnitsNo=2,\" in\"))&\" (Type 2)\"","v":"Luchtverhitter height 41 cm width 41 cm length 43 cm (Type 2)"}]
[]
[]
[]
[]
[]
[null,{"$f":"cal!$X$1&\" \"&$T$16&\" \"&ROUND(cal!X34,1)&IF(UnitsNo=1,\" cm\",IF(UnitsNo=2,\" in\"))& \" \"&$T$17&\" \"&ROUND(cal!Z34,1)&IF(UnitsNo=1,\" cm\",IF(UnitsNo=2,\" in\"))&\" \"&$T$18&\" \"&ROUND(cal!AB34,1)&IF(UnitsNo=1,\" cm\",IF(UnitsNo=2,\" in\"))&\" (Type 3)\"","v":"Luchtverhitter height 0 cm width 0 cm length 0 cm (Type 3)"}]
[]
[]
[]
[]
[]
[null,{"$f":"cal!$X$1&\" \"&$T$16&\" \"&ROUND(cal!X40,1)&IF(UnitsNo=1,\" cm\",IF(UnitsNo=2,\" in\"))& \" \"&$T$17&\" \"&ROUND(cal!Z40,1)&IF(UnitsNo=1,\" cm\",IF(UnitsNo=2,\" in\"))&\" \"&$T$18&\" \"&ROUND(cal!AB40,1)&IF(UnitsNo=1,\" cm\",IF(UnitsNo=2,\" in\"))&\" (Type 4)\"","v":"Luchtverhitter height 0 cm width 0 cm length 0 cm (Type 4)"}]
[]
[]
[]
[]
[]
[null,"*Sound power according to ISO 3741:2010",{"$nulls":11},{"$f":"cal!P46","v":"v2025-07-25"}]
[null,"**Sound pressure with an assumed room damping of 8dB(A)"]

{"sheet":"ExtraTaal2","index":11,"n_rows":41,"n_cols":20,"rows_kept":41,"hidden":true,"merged":[[3,7,3,10],[4,7,4,10],[8,1,8,3],[8,6,8,9],[8,12,8,13],[9,1,9,3],[9,6,9,9],[10,6,10,9],[15,1,15,13],[21,1,21,13],[27,1,27,13],[33,1,33,13]]}
[]
[]
[null,"Formulary"]
[{"$nulls":7},"Hydraulic mix:",0,0,0]
[null,"Conditions",{"$nulls":5},"Device - Ventilator - Utilization:",0,0,0]
[]
[null,"Temperatures",{"$nulls":14},"Copy all data"]
[null,"Heating:",{"$nulls":4},"Cooling:",{"$nulls":9},"SI-units"]
[null,"Supply water",null,null,{"$f":"cal!E9","v":55},null,{"$f":"B9","v":"Supply water"},{"$nulls":3},{"$f":"cal!K9","v":16},null,"Unit conversion",{"$nulls":3},"Imperial-units"]
[null,"Return water",null,null,{"$f":"cal!E10","v":45},null,{"$f":"B10","v":"Return water"},{"$nulls":3},{"$f":"cal!K10","v":{"v":18.22222222222222,"d":"18"}}]
[null,"Entering air",null,null,{"$f":"cal!E11","v":20},null,{"$f":"B11","v":"Entering air"},{"$nulls":3},{"$f":"cal!K11","v":27}]
[{"$nulls":6},"Relative humidity",{"$nulls":3},{"$f":"cal!K12","v":{"v":0.5,"d":"50%"}}]
[]
[]
[null,"Speed level","Control voltage [V]",{"$f":"CONCATENATE(\"Heat output  \",ROUND(E9,0),\"/\",ROUND(E10,0),\"/\",ROUND(E11,0),\" [\"&IF(cal!$W$4=1,\"W\",IF(cal!$W$4=2,\"Btu/h\"))&\"]\")","v":"Heat output  55/45/20 [W]"},{"$f":"\"Water flowrate, heating [\"&IF(cal!$W$4=1,\"l/h\",IF(cal!$W$4=2,\"GPM\"))&\"]\"","v":"Water flowrate, heating [l/h]"},{"$f":"\"Watersided pressure loss [\"&IF(cal!$W$4=1,\"kPa\",IF(cal!$W$4=2,\"inH2O\"))&\"]\"","v":"Watersided pressure loss [kPa]"},{"$f":"CONCATENATE(\"Sens. cooling capacity  \",ROUND(K9,0),\"/\",ROUND(K10,0),\"/\",ROUND(K11,0),\" [\"&IF(cal!$W$4=1,\"W\",IF(cal!$W$4=2,\"Btu/h\"))&\"]\")","v":"Sens. cooling capacity  16/18/27 [W]"},{"$f":"CONCATENATE(\"Tot. cooling capacity \",ROUND(K9,0),\"/\",ROUND(K10,0),\"/\",ROUND(K11,0),\" [\"&IF(cal!$W$4=1,\"W\",IF(cal!$W$4=2,\"Btu/h\"))&\"]\")","v":"Tot. cooling capacity 16/18/27 [W]"},{"$f":"\"Water flowrate, cooling [\"&IF(cal!$W$4=1,\"l/h\",IF(cal!$W$4=2,\"GPM\"))&\"]\"","v":"Water flowrate, cooling [l/h]"},{"$f":"\"Watersided pressure loss [\"&IF(cal!$W$4=1,\"kPa\",IF(cal!$W$4=2,\"inH2O\"))&\"]\"","v":"Watersided pressure loss [kPa]"},"Sound pressure ** [dB(A)]","Sound power * [dB(A)]","Electrical power [W]",{"$f":"\"Air flowrate [\"&IF(cal!$W$4=1,\"m³/h\",IF(cal!$W$4=2,\"CFM\"))&\"]\"","v":"Air flowrate [m³/h]"},{"$f":"\"Air exhaust temp. heating  [\"&IF(cal!$W$4=1,\"°C\",IF(cal!$W$4=2,\"°F\"))&\"]\"","v":"Air exhaust temp. heating  [°C]"},{"$f":"\"Air exhaust temp. cooling  [\"&IF(cal!$W$4=1,\"°C\",IF(cal!$W$4=2,\"°F\"))&\"]\"","v":"Air exhaust temp. cooling  [°C]"}]
[null,{"$f":"cal!$X$1&\" \"&$T$16&\" \"&ROUND(cal!X22,1)&IF(UnitsNo=1,\" cm\",IF(UnitsNo=2,\" in\"))& \" \"&$T$17&\" \"&ROUND(cal!Z22,1)&IF(UnitsNo=1,\" cm\",IF(UnitsNo=2,\" in\"))&\" \"&$T$18&\" \"&ROUND(cal!AB22,1)&IF(UnitsNo=1,\" cm\",IF(UnitsNo=2,\" in\"))&\" (Type 1)\"","v":"Luchtverhitter height 41 cm width 41 cm length 43 cm (Type 1)"},{"$nulls":15},"Temp.",null,"height"]
[{"$nulls":17},"heating!",null,"width"]
[{"$nulls":17},"cooling!",null,"length"]
[]
[]
[]
[null,{"$f":"cal!$X$1&\" \"&$T$16&\" \"&ROUND(cal!X28,1)&IF(UnitsNo=1,\" cm\",IF(UnitsNo=2,\" in\"))& \" \"&$T$17&\" \"&ROUND(cal!Z28,1)&IF(UnitsNo=1,\" cm\",IF(UnitsNo=2,\" in\"))&\" \"&$T$18&\" \"&ROUND(cal!AB28,1)&IF(UnitsNo=1,\" cm\",IF(UnitsNo=2,\" in\"))&\" (Type 2)\"","v":"Luchtverhitter height 41 cm width 41 cm length 43 cm (Type 2)"}]
[]
[]
[]
[]
[]
[null,{"$f":"cal!$X$1&\" \"&$T$16&\" \"&ROUND(cal!X34,1)&IF(UnitsNo=1,\" cm\",IF(UnitsNo=2,\" in\"))& \" \"&$T$17&\" \"&ROUND(cal!Z34,1)&IF(UnitsNo=1,\" cm\",IF(UnitsNo=2,\" in\"))&\" \"&$T$18&\" \"&ROUND(cal!AB34,1)&IF(UnitsNo=1,\" cm\",IF(UnitsNo=2,\" in\"))&\" (Type 3)\"","v":"Luchtverhitter height 0 cm width 0 cm length 0 cm (Type 3)"}]
[]
[]
[]
[]
[]
[null,{"$f":"cal!$X$1&\" \"&$T$16&\" \"&ROUND(cal!X40,1)&IF(UnitsNo=1,\" cm\",IF(UnitsNo=2,\" in\"))& \" \"&$T$17&\" \"&ROUND(cal!Z40,1)&IF(UnitsNo=1,\" cm\",IF(UnitsNo=2,\" in\"))&\" \"&$T$18&\" \"&ROUND(cal!AB40,1)&IF(UnitsNo=1,\" cm\",IF(UnitsNo=2,\" in\"))&\" (Type 4)\"","v":"Luchtverhitter height 0 cm width 0 cm length 0 cm (Type 4)"}]
[]
[]
[]
[]
[]
[null,"*Sound power according to ISO 3741:2010",{"$nulls":11},{"$f":"cal!P46","v":"v2025-07-25"}]
[null,"**Sound pressure with an assumed room damping of 8dB(A)"]

{"sheet":"ExtraTaal3","index":12,"n_rows":41,"n_cols":20,"rows_kept":41,"hidden":true,"merged":[[3,7,3,10],[4,7,4,10],[8,1,8,3],[8,6,8,9],[8,12,8,13],[9,1,9,3],[9,6,9,9],[10,6,10,9],[15,1,15,13],[21,1,21,13],[27,1,27,13],[33,1,33,13]]}
[]
[]
[null,"Formulary"]
[{"$nulls":7},"Hydraulic mix:",0,0,0]
[null,"Conditions",{"$nulls":5},"Device - Ventilator - Utilization:",0,0,0]
[]
[null,"Temperatures",{"$nulls":14},"Copy all data"]
[null,"Heating:",{"$nulls":4},"Cooling:",{"$nulls":9},"SI-units"]
[null,"Supply water",null,null,{"$f":"cal!E9","v":55},null,{"$f":"B9","v":"Supply water"},{"$nulls":3},{"$f":"cal!K9","v":16},null,"Unit conversion",{"$nulls":3},"Imperial-units"]
[null,"Return water",null,null,{"$f":"cal!E10","v":45},null,{"$f":"B10","v":"Return water"},{"$nulls":3},{"$f":"cal!K10","v":{"v":18.22222222222222,"d":"18"}}]
[null,"Entering air",null,null,{"$f":"cal!E11","v":20},null,{"$f":"B11","v":"Entering air"},{"$nulls":3},{"$f":"cal!K11","v":27}]
[{"$nulls":6},"Relative humidity",{"$nulls":3},{"$f":"cal!K12","v":{"v":0.5,"d":"50%"}}]
[]
[]
[null,"Speed level","Control voltage [V]",{"$f":"CONCATENATE(\"Heat output  \",ROUND(E9,0),\"/\",ROUND(E10,0),\"/\",ROUND(E11,0),\" [\"&IF(cal!$W$4=1,\"W\",IF(cal!$W$4=2,\"Btu/h\"))&\"]\")","v":"Heat output  55/45/20 [W]"},{"$f":"\"Water flowrate, heating [\"&IF(cal!$W$4=1,\"l/h\",IF(cal!$W$4=2,\"GPM\"))&\"]\"","v":"Water flowrate, heating [l/h]"},{"$f":"\"Watersided pressure loss [\"&IF(cal!$W$4=1,\"kPa\",IF(cal!$W$4=2,\"inH2O\"))&\"]\"","v":"Watersided pressure loss [kPa]"},{"$f":"CONCATENATE(\"Sens. cooling capacity  \",ROUND(K9,0),\"/\",ROUND(K10,0),\"/\",ROUND(K11,0),\" [\"&IF(cal!$W$4=1,\"W\",IF(cal!$W$4=2,\"Btu/h\"))&\"]\")","v":"Sens. cooling capacity  16/18/27 [W]"},{"$f":"CONCATENATE(\"Tot. cooling capacity \",ROUND(K9,0),\"/\",ROUND(K10,0),\"/\",ROUND(K11,0),\" [\"&IF(cal!$W$4=1,\"W\",IF(cal!$W$4=2,\"Btu/h\"))&\"]\")","v":"Tot. cooling capacity 16/18/27 [W]"},{"$f":"\"Water flowrate, cooling [\"&IF(cal!$W$4=1,\"l/h\",IF(cal!$W$4=2,\"GPM\"))&\"]\"","v":"Water flowrate, cooling [l/h]"},{"$f":"\"Watersided pressure loss [\"&IF(cal!$W$4=1,\"kPa\",IF(cal!$W$4=2,\"inH2O\"))&\"]\"","v":"Watersided pressure loss [kPa]"},"Sound pressure ** [dB(A)]","Sound power * [dB(A)]","Electrical power [W]",{"$f":"\"Air flowrate [\"&IF(cal!$W$4=1,\"m³/h\",IF(cal!$W$4=2,\"CFM\"))&\"]\"","v":"Air flowrate [m³/h]"},{"$f":"\"Air exhaust temp. heating  [\"&IF(cal!$W$4=1,\"°C\",IF(cal!$W$4=2,\"°F\"))&\"]\"","v":"Air exhaust temp. heating  [°C]"},{"$f":"\"Air exhaust temp. cooling  [\"&IF(cal!$W$4=1,\"°C\",IF(cal!$W$4=2,\"°F\"))&\"]\"","v":"Air exhaust temp. cooling  [°C]"}]
[null,{"$f":"cal!$X$1&\" \"&$T$16&\" \"&ROUND(cal!X22,1)&IF(UnitsNo=1,\" cm\",IF(UnitsNo=2,\" in\"))& \" \"&$T$17&\" \"&ROUND(cal!Z22,1)&IF(UnitsNo=1,\" cm\",IF(UnitsNo=2,\" in\"))&\" \"&$T$18&\" \"&ROUND(cal!AB22,1)&IF(UnitsNo=1,\" cm\",IF(UnitsNo=2,\" in\"))&\" (Type 1)\"","v":"Luchtverhitter height 41 cm width 41 cm length 43 cm (Type 1)"},{"$nulls":15},"Temp.",null,"height"]
[{"$nulls":17},"heating!",null,"width"]
[{"$nulls":17},"cooling!",null,"length"]
[]
[]
[]
[null,{"$f":"cal!$X$1&\" \"&$T$16&\" \"&ROUND(cal!X28,1)&IF(UnitsNo=1,\" cm\",IF(UnitsNo=2,\" in\"))& \" \"&$T$17&\" \"&ROUND(cal!Z28,1)&IF(UnitsNo=1,\" cm\",IF(UnitsNo=2,\" in\"))&\" \"&$T$18&\" \"&ROUND(cal!AB28,1)&IF(UnitsNo=1,\" cm\",IF(UnitsNo=2,\" in\"))&\" (Type 2)\"","v":"Luchtverhitter height 41 cm width 41 cm length 43 cm (Type 2)"}]
[]
[]
[]
[]
[]
[null,{"$f":"cal!$X$1&\" \"&$T$16&\" \"&ROUND(cal!X34,1)&IF(UnitsNo=1,\" cm\",IF(UnitsNo=2,\" in\"))& \" \"&$T$17&\" \"&ROUND(cal!Z34,1)&IF(UnitsNo=1,\" cm\",IF(UnitsNo=2,\" in\"))&\" \"&$T$18&\" \"&ROUND(cal!AB34,1)&IF(UnitsNo=1,\" cm\",IF(UnitsNo=2,\" in\"))&\" (Type 3)\"","v":"Luchtverhitter height 0 cm width 0 cm length 0 cm (Type 3)"}]
[]
[]
[]
[]
[]
[null,{"$f":"cal!$X$1&\" \"&$T$16&\" \"&ROUND(cal!X40,1)&IF(UnitsNo=1,\" cm\",IF(UnitsNo=2,\" in\"))& \" \"&$T$17&\" \"&ROUND(cal!Z40,1)&IF(UnitsNo=1,\" cm\",IF(UnitsNo=2,\" in\"))&\" \"&$T$18&\" \"&ROUND(cal!AB40,1)&IF(UnitsNo=1,\" cm\",IF(UnitsNo=2,\" in\"))&\" (Type 4)\"","v":"Luchtverhitter height 0 cm width 0 cm length 0 cm (Type 4)"}]
[]
[]
[]
[]
[]
[null,"*Sound power according to ISO 3741:2010",{"$nulls":11},{"$f":"cal!P46","v":"v2025-07-25"}]
[null,"**Sound pressure with an assumed room damping of 8dB(A)"]