{"text_format":"3","workbook":"xlsx","n_sheets":13,"sheets":["Luchtverhitter","cal","NL","EN","DE","FR","NR","SP","SW","TS","ExtraTaal1","ExtraTaal2","ExtraTaal3"],"not_rendered":{"images":5,"macros":1,"defined_names":10,"comments":1},"read":"whole","date_system":"1900"}

{"sheet":"Luchtverhitter","index":0,"n_rows":28,"n_cols":14,"rows_kept":28,"merged":[[0,14,1,15],[1,1,1,2],[1,6,1,9],[1,10,1,11],[2,1,2,2],[2,14,2,15],[3,6,3,9],[3,10,3,12],[3,14,3,15],[7,1,7,3],[7,6,7,9],[7,12,7,13],[8,1,8,3],[8,6,8,9],[8,12,11,13],[9,1,9,3],[9,6,9,9],[10,6,10,9],[14,1,14,15],[20,1,20,15]]}
[]
[null,"Selectiontool",{"$nulls":4},"Taal/Language/Sprache/Språk/Jazyk",0,0,0,"Nederlands"]
[null,{"$f":"HLOOKUP(K2,cal!E1:M2,2,FALSE)","v":"luchtverhitter"}]
[{"$nulls":6},{"$f":"IF(cal!$S$7=1,\"Uitvoering\",IF(cal!$S$7=2,\"Version\",IF(cal!$S$7=3,\"Ausführung\",IF(cal!$S$7=4,\"Version\",IF(cal!$S$7=5,\"Modell\",IF(cal!$S$7=6,\"Montaje\",IF(cal!$S$7=7,\"Version\",IF(cal!$S$7=8,\"Verze\",IF(cal!$S$7=9,\"ExtraTaal1\",IF(cal!$S$7=10,\"ExtraTaal2\",IF(cal!$S$7=11,\"ExtraTaal3\",)))))))))))","v":"Uitvoering"},{"$nulls":3},"021/031"]
[]
[null,{"$f":"cal!B7","v":"Temperaturen"}]
[null,{"$f":"cal!B8","v":"Verwarmen:"},{"$nulls":4},{"$f":"cal!G8","v":"Koelen:"}]
[null,{"$f":"cal!B9","v":"Water aanvoer"},{"$f":"cal!C9","v":0},{"$f":"cal!D9","v":0},55,{"$f":"cal!F9","v":"°C"},{"$f":"cal!G9","v":"Water aanvoer"},{"$f":"cal!H9","v":0},{"$f":"cal!I9","v":0},{"$f":"cal!J9","v":0},16,{"$f":"cal!L9","v":"°C"},{"$f":"cal!M9","v":"Eenheidsstelsel"}]
[null,{"$f":"cal!B10","v":"Water retour"},{"$f":"cal!C10","v":0},{"$f":"cal!D10","v":0},45,{"$f":"cal!F10","v":"°C"},{"$f":"cal!G10","v":"Water retour"},{"$f":"cal!H10","v":0},{"$f":"cal!I10","v":0},{"$f":"cal!J10","v":0},{"v":18.22222222222222,"d":"18"},{"$f":"cal!L10","v":"°C"}]
[null,{"$f":"cal!B11","v":"Ruimte"},{"$f":"cal!C11","v":0},{"$f":"cal!D11","v":0},20,{"$f":"cal!F11","v":"°C"},{"$f":"cal!G11","v":"Ruimte"},{"$f":"cal!H11","v":0},{"$f":"cal!I11","v":0},{"$f":"cal!J11","v":0},27,{"$f":"cal!L11","v":"°C"}]
{"$rows_left_out":19}
{"sheet":"cal","index":1,"n_rows":47,"n_cols":94,"rows_kept":47,"hidden":true,"merged":[[2,6,2,9],[4,6,4,9],[6,12,6,13],[7,12,7,13],[8,1,8,3],[8,6,8,9],[8,12,8,13],[9,1,9,3],[9,6,9,9],[10,1,10,3],[10,6,10,9],[15,1,15,15],[15,22,15,28],[15,30,15,36],[15,37,15,43],[15,44,15,50],[15,51,15,57],[15,58,15,64],[15,65,15,71],[15,72,15,78],[15,79,15,85],[15,86,15,92],[15,93,15,99],[27,1,27,15],[33,1,33,15],[39,1,39,15]]}
[{"$nulls":4},"Nederlands","English","Deutsch","Français","Norsk","Español","Svenska","Čeština","ExtraTaal1","ExtraTaal2","ExtraTaal3",{"$nulls":8},"Luchtverhitter",{"$nulls":14},{"$f":"Tv_cool","v":16},{"$nulls":3},{"$f":"W12","v":{"v":0.5,"d":"50%"}}]
[{"$nulls":4},"luchtverhitter","unit heater","Lufterhitzer","aérotherme","vifteovn","calentador","fläktvärmare","ohřívač ventilátoru",{"$nulls":11},"021/031",{"$nulls":14},{"$f":"Tr_cool","v":18.22222222222222}]
[null,{"$f":"IF($S$7=1,NL!B3,IF(cal!$S$7=2,EN!B3,IF(cal!$S$7=3,DE!B3,IF(cal!$S$7=4,FR!B3,IF(cal!$S$7=5,NR!B3,IF(cal!$S$7=6,SP!B3,IF(cal!$S$7=7,SW!B3,IF(cal!$S$7=8,TS!B3,IF(cal!$S$7=9,ExtraTaal1!B3,IF(cal!$S$7=10,ExtraTaal2!B3,IF(cal!$S$7=11,ExtraTaal3!B3,)))))))))))","v":"Invulformulier"},{"$nulls":21},"121/131",null,{"$f":"IF($S$7=1,NL!R16,IF(cal!$S$7=2,EN!R16,IF(cal!$S$7=3,DE!R16,IF(cal!$S$7=4,FR!R16,IF(cal!$S$7=5,NR!R16,IF(cal!$S$7=6,SP!R16,IF(cal!$S$7=7,SW!R16,IF(cal!$S$7=8,TS!R16,IF(cal!$S$7=9,ExtraTaal1!R16,IF(cal!$S$7=10,ExtraTaal2!R16,IF(cal!$S$7=11,ExtraTaal3!R16,)))))))))))","v":"Temp."},{"$f":"IF($S$7=1,NL!Q7,IF(cal!$S$7=2,EN!Q7,IF(cal!$S$7=3,DE!Q7,IF(cal!$S$7=4,FR!Q7,IF(cal!$S$7=5,NR!Q7,IF(cal!$S$7=6,SP!Q7,IF(cal!$S$7=7,SW!Q7,IF(cal!$S$7=8,TS!Q7,IF(cal!$S$7=9,ExtraTaal1!Q7,IF(cal!$S$7=10,ExtraTaal2!Q7,IF(cal!$S$7=11,ExtraTaal3!Q7,)))))))))))","v":"Kopieer alle data"},{"$nulls":11},{"$f":"Tl_cool","v":27}]
[{"$nulls":22},1,"221/231",null,{"$f":"IF($S$7=1,NL!R17,IF(cal!$S$7=2,EN!R17,IF(cal!$S$7=3,DE!R17,IF(cal!$S$7=4,FR!R17,IF(cal!$S$7=5,NR!R17,IF(cal!$S$7=6,SP!R17,IF(cal!$S$7=7,SW!R17,IF(cal!$S$7=8,TS!R17,IF(cal!$S$7=9,ExtraTaal1!R17,IF(cal!$S$7=10,ExtraTaal2!R17,IF(cal!$S$7=11,ExtraTaal3!R17,)))))))))))","v":"verw.!"},{"$f":"IF($S$7=1,NL!Q8,IF(cal!$S$7=2,EN!Q8,IF(cal!$S$7=3,DE!Q8,IF(cal!$S$7=4,FR!Q8,IF(cal!$S$7=5,NR!Q8,IF(cal!$S$7=6,SP!Q8,IF(cal!$S$7=7,SW!Q8,IF(cal!$S$7=8,TS!Q8,IF(cal!$S$7=9,ExtraTaal1!Q8,IF(cal!$S$7=10,ExtraTaal2!Q8,IF(cal!$S$7=11,ExtraTaal3!Q8,)))))))))))","v":"SI-eenheden"}]
[null,{"$f":"IF($S$7=1,NL!B5,IF(cal!$S$7=2,EN!B5,IF(cal!$S$7=3,DE!B5,IF(cal!$S$7=4,FR!B5,IF(cal!$S$7=5,NR!B5,IF(cal!$S$7=6,SP!B5,IF(cal!$S$7=7,SW!B5,IF(cal!$S$7=8,TS!B5,IF(cal!$S$7=9,ExtraTaal1!B5,IF(cal!$S$7=10,ExtraTaal2!B5,IF(cal!$S$7=11,ExtraTaal3!B5,)))))))))))","v":"Randvoorwaarden"},{"$nulls":21},"321/331",null,{"$f":"IF($S$7=1,NL!R18,IF(cal!$S$7=2,EN!R18,IF(cal!$S$7=3,DE!R18,IF(cal!$S$7=4,FR!R18,IF(cal!$S$7=5,NR!R18,IF(cal!$S$7=6,SP!R18,IF(cal!$S$7=7,SW!R18,IF(cal!$S$7=8,TS!R18,IF(cal!$S$7=9,ExtraTaal1!R18,IF(cal!$S$7=10,ExtraTaal2!R18,IF(cal!$S$7=11,ExtraTaal3!R18,)))))))))))","v":"koelen!"},{"$f":"IF($S$7=1,NL!Q9,IF(cal!$S$7=2,EN!Q9,IF(cal!$S$7=3,DE!Q9,IF(cal!$S$7=4,FR!Q9,IF(cal!$S$7=5,NR!Q9,IF(cal!$S$7=6,SP!Q9,IF(cal!$S$7=7,SW!Q9,IF(cal!$S$7=8,TS!Q9,IF(cal!$S$7=9,ExtraTaal1!Q9,IF(cal!$S$7=10,ExtraTaal2!Q9,IF(cal!$S$7=11,ExtraTaal3!Q9,)))))))))))","v":"Imperiale-eenheden"}]
[{"$nulls":23},"421/431"]
[null,{"$f":"IF($S$7=1,NL!B7,IF(cal!$S$7=2,EN!B7,IF(cal!$S$7=3,DE!B7,IF(cal!$S$7=4,FR!B7,IF(cal!$S$7=5,NR!B7,IF(cal!$S$7=6,SP!B7,IF(cal!$S$7=7,SW!B7,IF(cal!$S$7=8,TS!B7,IF(cal!$S$7=9,ExtraTaal1!B7,IF(cal!$S$7=10,ExtraTaal2!B7,IF(cal!$S$7=11,ExtraTaal3!B7,)))))))))))","v":"Temperaturen"},{"$nulls":10},{"$f":"IF($S$7=8,\"Výška umístění\",\"h_atm\")","v":"h_atm"},{"$nulls":5},{"$f":"IF(Luchtverhitter!$K$2=cal!$E$1,1,IF(Luchtverhitter!$K$2=cal!$F$1,2,IF(Luchtverhitter!$K$2=cal!G1,3,IF(Luchtverhitter!$K$2=cal!H1,4,IF(Luchtverhitter!$K$2=cal!I1,5,IF(Luchtverhitter!$K$2=cal!J1,6,IF(Luchtverhitter!$K$2=cal!K1,7,IF(Luchtverhitter!$K$2=cal!L1,8,IF(Luchtverhitter!$K$2=cal!M1,9,IF(Luchtverhitter!$K$2=cal!N1,10,IF(Luchtverhitter!$K$2=cal!O1,11,)))))))))))","v":1}]
[null,{"$f":"IF($S$7=1,NL!B8,IF(cal!$S$7=2,EN!B8,IF(cal!$S$7=3,DE!B8,IF(cal!$S$7=4,FR!B8,IF(cal!$S$7=5,NR!B8,IF(cal!$S$7=6,SP!B8,IF(cal!$S$7=7,SW!B8,IF(cal!$S$7=8,TS!B8,IF(cal!$S$7=9,ExtraTaal1!B8,IF(cal!$S$7=10,ExtraTaal2!B8,IF(cal!$S$7=11,ExtraTaal3!B8,)))))))))))","v":"Verwarmen:"},{"$nulls":4},{"$f":"IF($S$7=1,NL!G8,IF(cal!$S$7=2,EN!G8,IF(cal!$S$7=3,DE!G8,IF(cal!$S$7=4,FR!G8,IF(cal!$S$7=5,NR!G8,IF(cal!$S$7=6,SP!G8,IF(cal!$S$7=7,SW!G8,IF(cal!$S$7=8,TS!G8,IF(cal!$S$7=9,ExtraTaal1!G8,IF(cal!$S$7=10,ExtraTaal2!G8,IF(cal!$S$7=11,ExtraTaal3!G8,)))))))))))","v":"Koelen:"},{"$nulls":5},{"$f":"Luchtverhitter!M7","v":{"v":0,"d":"0.00"}},{"$f":"Luchtverhitter!N7","v":{"v":0,"d":"0.00"}},{"$nulls":4},"Temp",{"$nulls":3},"Temp"]
[null,{"$f":"IF($S$7=1,NL!B9,IF(cal!$S$7=2,EN!B9,IF(cal!$S$7=3,DE!B9,IF(cal!$S$7=4,FR!B9,IF(cal!$S$7=5,NR!B9,IF(cal!$S$7=6,SP!B9,IF(cal!$S$7=7,SW!B9,IF(cal!$S$7=8,TS!B9,IF(cal!$S$7=9,ExtraTaal1!B9,IF(cal!$S$7=10,ExtraTaal2!B9,IF(cal!$S$7=11,ExtraTaal3!B9,)))))))))))","v":"Water aanvoer"},{"$f":"IF($S$7=1,NL!C9,IF(cal!$S$7=2,EN!C9,IF(cal!$S$7=3,DE!C9,IF(cal!$S$7=4,FR!C9,IF(cal!$S$7=5,NR!C9,IF(cal!$S$7=6,SP!C9,IF(cal!$S$7=7,SW!C9,IF(cal!$S$7=8,TS!C9,IF(cal!$S$7=9,ExtraTaal1!C9,IF(cal!$S$7=10,ExtraTaal2!C9,IF(cal!$S$7=11,ExtraTaal3!C9,)))))))))))","v":0},{"$f":"IF($S$7=1,NL!D9,IF(cal!$S$7=2,EN!D9,IF(cal!$S$7=3,DE!D9,IF(cal!$S$7=4,FR!D9,IF(cal!$S$7=5,NR!D9,IF(cal!$S$7=6,SP!D9,IF(cal!$S$7=7,SW!D9,IF(cal!$S$7=8,TS!D9,IF(cal!$S$7=9,ExtraTaal1!D9,IF(cal!$S$7=10,ExtraTaal2!D9,IF(cal!$S$7=11,ExtraTaal3!D9,)))))))))))","v":0},{"$f":"Luchtverhitter!E8","v":55},{"$f":"IF($W$4=1,\"°C\",IF($W$4=2,\"°F\",))","v":"°C"},{"$f":"B9","v":"Water aanvoer"},{"$f":"IF($S$7=1,NL!H9,IF(cal!$S$7=2,EN!H9,IF(cal!$S$7=3,DE!H9,IF(cal!$S$7=4,FR!H9,))))","v":0},{"$f":"IF($S$7=1,NL!I9,IF(cal!$S$7=2,EN!I9,IF(cal!$S$7=3,DE!I9,IF(cal!$S$7=4,FR!I9,))))","v":0},{"$f":"IF($S$7=1,NL!J9,IF(cal!$S$7=2,EN!J9,IF(cal!$S$7=3,DE!J9,IF(cal!$S$7=4,FR!J9,))))","v":0},{"$f":"Luchtverhitter!K8","v":16},{"$f":"F9","v":"°C"},{"$f":"IF($S$7=1,NL!M9,IF(cal!$S$7=2,EN!M9,IF(cal!$S$7=3,DE!M9,IF(cal!$S$7=4,FR!M9,IF(cal!$S$7=5,NR!M9,IF(cal!$S$7=6,SP!M9,))))))","v":"Eenheidsstelsel"},{"$f":"IF($S$7=1,NL!N9,IF(cal!$S$7=2,EN!N9,IF(cal!$S$7=3,DE!N9,IF(cal!$S$7=4,FR!N9,IF(cal!$S$7=5,#REF!,)))))","v":0},{"$nulls":4},{"$f":"IF($W$4=1,E9,IF($W$4=2,(E9-32)/1.8))","v":{"v":55,"d":"55.0"}},{"$nulls":3},{"$f":"IF($W$4=1,K9,IF($W$4=2,(K9-32)/1.8))","v":{"v":16,"d":"16.0"}}]
[null,{"$f":"IF($S$7=1,NL!B10,IF(cal!$S$7=2,EN!B10,IF(cal!$S$7=3,DE!B10,IF(cal!$S$7=4,FR!B10,IF(cal!$S$7=5,NR!B10,IF(cal!$S$7=6,SP!B10,IF(cal!$S$7=7,SW!B10,IF(cal!$S$7=8,TS!B10,IF(cal!$S$7=9,ExtraTaal1!B10,IF(cal!$S$7=10,ExtraTaal2!B10,IF(cal!$S$7=11,ExtraTaal3!B10,)))))))))))","v":"Water retour"},{"$f":"IF($S$7=1,NL!C10,IF(cal!$S$7=2,EN!C10,IF(cal!$S$7=3,DE!C10,IF(cal!$S$7=4,FR!C10,IF(cal!$S$7=5,NR!C10,IF(cal!$S$7=6,SP!C10,IF(cal!$S$7=7,SW!C10,IF(cal!$S$7=8,TS!C10,IF(cal!$S$7=9,ExtraTaal1!C10,IF(cal!$S$7=10,ExtraTaal2!C10,IF(cal!$S$7=11,ExtraTaal3!C10,)))))))))))","v":0},{"$f":"IF($S$7=1,NL!D10,IF(cal!$S$7=2,EN!D10,IF(cal!$S$7=3,DE!D10,IF(cal!$S$7=4,FR!D10,IF(cal!$S$7=5,NR!D10,IF(cal!$S$7=6,SP!D10,IF(cal!$S$7=7,SW!D10,IF(cal!$S$7=8,TS!D10,IF(cal!$S$7=9,ExtraTaal1!D10,IF(cal!$S$7=10,ExtraTaal2!D10,IF(cal!$S$7=11,ExtraTaal3!D10,)))))))))))","v":0},{"$f":"Luchtverhitter!E9","v":45},{"$f":"F9","v":"°C"},{"$f":"B10","v":"Water retour"},{"$f":"IF($S$7=1,NL!H10,IF(cal!$S$7=2,EN!H10,IF(cal!$S$7=3,DE!H10,IF(cal!$S$7=4,FR!H10,))))","v":0},{"$f":"IF($S$7=1,NL!I10,IF(cal!$S$7=2,EN!I10,IF(cal!$S$7=3,DE!I10,IF(cal!$S$7=4,FR!I10,))))","v":0},{"$f":"IF($S$7=1,NL!J10,IF(cal!$S$7=2,EN!J10,IF(cal!$S$7=3,DE!J10,IF(cal!$S$7=4,FR!J10,))))","v":0},{"$f":"Luchtverhitter!K9","v":{"v":18.22222222222222,"d":"18"}},{"$f":"F9","v":"°C"},{"$nulls":6},{"$f":"IF($W$4=1,E10,IF($W$4=2,(E10-32)/1.8))","v":{"v":45,"d":"45.0"}},{"$nulls":3},{"$f":"IF($W$4=1,K10,IF($W$4=2,(K10-32)/1.8))","v":{"v":18.22222222222222,"d":"18.2"}},null,"p_atm","h[mm]","cf_h","dt og","dt nieuw heating","dt koeling",{"$nulls":4},"checking for condensation cooling"]
{"$rows_left_out":38}
{"sheet":"NL","index":2,"n_rows":41,"n_cols":20,"rows_kept":41,"hidden":true,"merged":[[3,7,3,10],[4,7,4,10],[8,1,8,3],[8,6,8,9],[8,12,8,13],[9,1,9,3],[9,6,9,9],[10,1,10,3],[10,6,10,9],[15,1,15,13],[21,1,21,13],[27,1,27,13],[33,1,33,13]]}
[]
[]
[null,"Invulformulier"]
[{"$nulls":7},"Hydraulisch mengsel:",0,0,0]
[null,"Randvoorwaarden",{"$nulls":5},"Toestel - Ventilator - Uitvoering:",0,0,0]
[]
[null,"Temperaturen",{"$nulls":14},"Kopieer alle data"]
[null,"Verwarmen:",{"$nulls":4},"Koelen:",{"$nulls":9},"SI-eenheden"]
[null,{"$f":"\"Water aanvoer\"","v":"Water aanvoer"},null,null,{"$f":"cal!E9","v":55},null,{"$f":"B9","v":"Water aanvoer"},{"$nulls":3},{"$f":"cal!K9","v":16},null,"Eenheidsstelsel",{"$nulls":3},"Imperiale-eenheden"]
[null,{"$f":"\"Water retour\"","v":"Water retour"},null,null,{"$f":"cal!E10","v":45},null,{"$f":"B10","v":"Water retour"},{"$nulls":3},{"$f":"cal!K10","v":{"v":18.22222222222222,"d":"18"}}]
{"$rows_left_out":32}
{"sheet":"EN","index":3,"n_rows":41,"n_cols":20,"rows_kept":41,"hidden":true,"merged":[[3,7,3,10],[4,7,4,10],[8,1,8,3],[8,6,8,9],[8,12,8,13],[9,1,9,3],[9,6,9,9],[10,6,10,9],[15,1,15,13],[21,1,21,13],[27,1,27,13],[33,1,33,13]]}
[]
[]
[null,"Formulary"]
[{"$nulls":7},"Hydraulic mix:",0,0,0]
[null,"Conditions",{"$nulls":5},"Device - Ventilator - Utilization:",0,0,0]
[]
[null,"Temperatures",{"$nulls":14},"Copy all data"]
[null,"Heating:",{"$nulls":4},"Cooling:",{"$nulls":9},"SI-units"]
[null,"Supply water",null,null,{"$f":"cal!E9","v":55},null,{"$f":"B9","v":"Supply water"},{"$nulls":3},{"$f":"cal!K9","v":16},null,"Unit conversion",{"$nulls":3},"Imperial-units"]
[null,"Return water",null,null,{"$f":"cal!E10","v":45},null,{"$f":"B10","v":"Return water"},{"$nulls":3},{"$f":"cal!K10","v":{"v":18.22222222222222,"d":"18"}}]
{"$rows_left_out":32}
{"sheet":"DE","index":4,"n_rows":41,"n_cols":20,"rows_kept":41,"hidden":true,"merged":[[3,7,3,10],[4,7,4,10],[8,1,8,3],[8,6,8,9],[8,12,8,13],[9,1,9,3],[9,6,9,9],[10,1,10,3],[10,6,10,9],[15,1,15,13],[21,1,21,13],[27,1,27,13],[33,1,33,13]]}
[]
[]
[null,"Eingabefelder"]
[{"$nulls":7},"Hydraulikgemisch:"]
[null,"Auslegungsrandbedingungen",{"$nulls":5},"Gerät - Lüfter - Ausfürhung:",0,0,0]
[]
[null,"Temperaturen",{"$nulls":14},"Kopieren Sie alle daten"]
[null,"Heizen:",{"$nulls":4},"Kühlen:",{"$nulls":9},"SI-einheiten"]
[null,{"$f":"\"Vorlauf wasser\"","v":"Vorlauf wasser"},null,null,{"$f":"cal!E9","v":55},null,{"$f":"B9","v":"Vorlauf wasser"},{"$nulls":3},{"$f":"cal!K9","v":16},null,"Einheiten",{"$nulls":3},"Imperiale-einheiten"]
[null,{"$f":"\"Rücklauf wasser\"","v":"Rücklauf wasser"},null,null,{"$f":"cal!E10","v":45},null,{"$f":"B10","v":"Rücklauf wasser"},{"$nulls":3},{"$f":"cal!K10","v":{"v":18.22222222222222,"d":"18"}}]
{"$rows_left_out":32}
{"sheet":"FR","index":5,"n_rows":41,"n_cols":20,"rows_kept":41,"hidden":true,"merged":[[3,7,3,10],[4,7,4,10],[8,1,8,3],[8,6,8,9],[8,12,8,13],[9,1,9,3],[9,6,9,9],[10,1,10,3],[10,6,10,9],[15,1,15,13],[21,1,21,13],[27,1,27,13],[33,1,33,13]]}
[]
[]
[null,"Formulaire"]
[{"$nulls":7},"Mélange hydraulique:"]
[null,"Conditions",{"$nulls":5},"Appareil - Ventilateur - Version:",0,0,0]
[]
[null,"Températures",{"$nulls":14},"Copier toutes des données"]
[null,"Chauffer:",{"$nulls":4},"Refroidir:",{"$nulls":9},"Unités-SI"]
[null,{"$f":"\"Entrée de l'eau\"","v":"Entrée de l'eau"},null,null,{"$f":"cal!E9","v":55},null,{"$f":"B9","v":"Entrée de l'eau"},{"$nulls":3},{"$f":"cal!K9","v":16},null,"Système unitaire",{"$nulls":3},"Unités-Impériales"]
[null,{"$f":"\"Retour de l'eau\"","v":"Retour de l'eau"},null,null,{"$f":"cal!E10","v":45},null,{"$f":"B10","v":"Retour de l'eau"},{"$nulls":3},{"$f":"cal!K10","v":{"v":18.22222222222222,"d":"18"}}]
{"$rows_left_out":32}
{"sheet":"NR","index":6,"n_rows":41,"n_cols":20,"rows_kept":41,"hidden":true,"merged":[[3,7,3,10],[4,7,4,10],[8,1,8,3],[8,6,8,9],[8,12,8,13],[9,1,9,3],[9,6,9,9],[10,1,10,3],[10,6,10,9],[11,6,11,9],[15,1,15,13],[21,1,21,13],[27,1,27,13],[33,1,33,13]]}
[]
[]
[null,"Modell"]
[{"$nulls":7},"Væske blanding:",0,0,0]
[null,"Conditions",{"$nulls":5},"Modell:",0,0,0]
[]
[null,"Temperaturer",{"$nulls":14},"Kopier alle data"]
[null,"Varme:",{"$nulls":4},"Kjøling:",{"$nulls":9},"SI-enheter"]
[null,"Tur vann",0,0,{"$f":"cal!E9","v":55},null,{"$f":"B9","v":"Tur vann"},{"$nulls":3},{"$f":"cal!K9","v":16},null,"Enhetssystem",{"$nulls":3},"Imperiale-enheter"]
[null,"Retur vann",0,0,{"$f":"cal!E10","v":45},null,{"$f":"B10","v":"Retur vann"},{"$nulls":3},{"$f":"cal!K10","v":{"v":18.22222222222222,"d":"18"}}]
{"$rows_left_out":32}
{"sheet":"SP","index":7,"n_rows":41,"n_cols":20,"rows_kept":41,"hidden":true,"merged":[[3,7,3,10],[4,7,4,10],[8,1,8,3],[8,6,8,9],[8,12,8,13],[9,1,9,3],[9,6,9,9],[10,1,10,3],[10,6,10,9],[11,6,11,9],[15,1,15,13],[21,1,21,13],[27,1,27,13],[33,1,33,13]]}
[]
[]
[]
[]
[]
[]
[null,"Temperaturas",{"$nulls":14},"Copiar todos los datos"]
[null,"Calefacción:",{"$nulls":4},"Enfriamiento:",{"$nulls":9},"Unidades-SI"]
[null,"Agua impulsión",0,0,{"$f":"cal!E9","v":55},null,{"$f":"B9","v":"Agua impulsión"},{"$nulls":3},{"$f":"cal!K9","v":16},null,"Convers. de unidades",{"$nulls":3},"Unidades-Imperial"]
[null,"Agua retorno",0,0,{"$f":"cal!E10","v":45},null,{"$f":"B10","v":"Agua retorno"},{"$nulls":3},{"$f":"cal!K10","v":{"v":18.22222222222222,"d":"18"}}]
{"$rows_left_out":32}
{"sheet":"SW","index":8,"n_rows":41,"n_cols":20,"rows_kept":41,"hidden":true,"merged":[[3,7,3,10],[4,7,4,10],[8,1,8,3],[8,6,8,9],[8,12,8,13],[9,1,9,3],[9,6,9,9],[10,6,10,9],[15,1,15,13],[21,1,21,13],[27,1,27,13],[33,1,33,13]]}
[]
[]
[null,"Formulary"]
[{"$nulls":7},"Hydraulic mix:",0,0,0]
[null,"Conditions",{"$nulls":5},"Device - Ventilator - Utilization:",0,0,0]
[]
[null,"Temperaturer",{"$nulls":14},"Kopiera all data"]
[null,"Värme:",{"$nulls":4},"Kyla:",{"$nulls":9},"SI-enheter"]
[null,"Tillopp",null,null,{"$f":"cal!E9","v":55},null,{"$f":"B9","v":"Tillopp"},{"$nulls":3},{"$f":"cal!K9","v":16},null,"Enhetssystem",{"$nulls":3},"Imperiella-enheter"]
[null,"Retur",null,null,{"$f":"cal!E10","v":45},null,{"$f":"B10","v":"Retur"},{"$nulls":3},{"$f":"cal!K10","v":{"v":18.22222222222222,"d":"18"}}]
{"$rows_left_out":32}
{"sheet":"TS","index":9,"n_rows":41,"n_cols":20,"rows_kept":41,"hidden":true,"merged":[[3,7,3,10],[4,7,4,10],[8,1,8,3],[8,6,8,9],[8,12,8,13],[9,1,9,3],[9,6,9,9],[10,1,10,3],[10,6,10,9],[15,1,15,13],[21,1,21,13],[27,1,27,13],[33,1,33,13]]}
[]
[]
[null,"Invulformulier"]
[{"$nulls":7},"Směs vody:",0,0,0]
[null,"Randvoorwaarden",{"$nulls":5},"Těleso - Ventilátor - Verze:",0,0,0]
[]
[null,"Teploty",{"$nulls":14},"Kopírovat všechna data"]
[null,"Topení:",{"$nulls":4},"Chlazení:",{"$nulls":9},"Mezinárodní (Sl)"]
[null,{"$f":"\"Voda na přívodu\"","v":"Voda na přívodu"},null,null,{"$f":"cal!E9","v":55},null,{"$f":"B9","v":"Voda na přívodu"},{"$nulls":3},{"$f":"cal!K9","v":16},null,"Převod jednotek",{"$nulls":3},"Imperiální"]
[null,{"$f":"\"Voda na zpátečce\"","v":"Voda na zpátečce"},null,null,{"$f":"cal!E10","v":45},null,{"$f":"B10","v":"Voda na zpátečce"},{"$nulls":3},{"$f":"cal!K10","v":{"v":18.22222222222222,"d":"18"}}]
{"$rows_left_out":32}
{"sheet":"ExtraTaal1","index":10,"n_rows":41,"n_cols":20,"rows_kept":41,"hidden":true,"merged":[[3,7,3,10],[4,7,4,10],[8,1,8,3],[8,6,8,9],[8,12,8,13],[9,1,9,3],[9,6,9,9],[10,6,10,9],[15,1,15,13],[21,1,21,13],[27,1,27,13],[33,1,33,13]]}
[]
[]
[null,"Formulary"]
[{"$nulls":7},"Hydraulic mix:",0,0,0]
[null,"Conditions",{"$nulls":5},"Device - Ventilator - Utilization:",0,0,0]
[]
[null,"Temperatures",{"$nulls":14},"Copy all data"]
[null,"Heating:",{"$nulls":4},"Cooling:",{"$nulls":9},"SI-units"]
[null,"Supply water",null,null,{"$f":"cal!E9","v":55},null,{"$f":"B9","v":"Supply water"},{"$nulls":3},{"$f":"cal!K9","v":16},null,"Unit conversion",{"$nulls":3},"Imperial-units"]
[null,"Return water",null,null,{"$f":"cal!E10","v":45},null,{"$f":"B10","v":"Return water"},{"$nulls":3},{"$f":"cal!K10","v":{"v":18.22222222222222,"d":"18"}}]
{"$rows_left_out":32}
{"sheet":"ExtraTaal2","index":11,"n_rows":41,"n_cols":20,"rows_kept":41,"hidden":true,"merged":[[3,7,3,10],[4,7,4,10],[8,1,8,3],[8,6,8,9],[8,12,8,13],[9,1,9,3],[9,6,9,9],[10,6,10,9],[15,1,15,13],[21,1,21,13],[27,1,27,13],[33,1,33,13]]}
[]
[]
[null,"Formulary"]
[{"$nulls":7},"Hydraulic mix:",0,0,0]
[null,"Conditions",{"$nulls":5},"Device - Ventilator - Utilization:",0,0,0]
[]
[null,"Temperatures",{"$nulls":14},"Copy all data"]
[null,"Heating:",{"$nulls":4},"Cooling:",{"$nulls":9},"SI-units"]
[null,"Supply water",null,null,{"$f":"cal!E9","v":55},null,{"$f":"B9","v":"Supply water"},{"$nulls":3},{"$f":"cal!K9","v":16},null,"Unit conversion",{"$nulls":3},"Imperial-units"]
[null,"Return water",null,null,{"$f":"cal!E10","v":45},null,{"$f":"B10","v":"Return water"},{"$nulls":3},{"$f":"cal!K10","v":{"v":18.22222222222222,"d":"18"}}]
{"$rows_left_out":32}
{"sheet":"ExtraTaal3","index":12,"n_rows":41,"n_cols":20,"rows_kept":41,"hidden":true,"merged":[[3,7,3,10],[4,7,4,10],[8,1,8,3],[8,6,8,9],[8,12,8,13],[9,1,9,3],[9,6,9,9],[10,6,10,9],[15,1,15,13],[21,1,21,13],[27,1,27,13],[33,1,33,13]]}
[]
[]
[null,"Formulary"]
[{"$nulls":7},"Hydraulic mix:",0,0,0]
[null,"Conditions",{"$nulls":5},"Device - Ventilator - Utilization:",0,0,0]
[]
[null,"Temperatures",{"$nulls":14},"Copy all data"]
[null,"Heating:",{"$nulls":4},"Cooling:",{"$nulls":9},"SI-units"]
[null,"Supply water",null,null,{"$f":"cal!E9","v":55},null,{"$f":"B9","v":"Supply water"},{"$nulls":3},{"$f":"cal!K9","v":16},null,"Unit conversion",{"$nulls":3},"Imperial-units"]
[null,"Return water",null,null,{"$f":"cal!E10","v":45},null,{"$f":"B10","v":"Return water"},{"$nulls":3},{"$f":"cal!K10","v":{"v":18.22222222222222,"d":"18"}}]
{"$rows_left_out":31}