{"text_format":"3","workbook":"xlsx","n_sheets":13,"sheets":["Briza 12","cal","NL","EN","DE","FR","NR","SP","SW","TS","ExtraTaal1","ExtraTaal2","ExtraTaal3"],"not_rendered":{"images":4,"macros":1,"defined_names":10},"read":"whole","date_system":"1900"}

{"sheet":"Briza 12","index":0,"n_rows":40,"n_cols":16,"rows_kept":40,"merged":[[0,14,1,15],[1,1,1,2],[1,6,1,9],[1,10,1,11],[2,1,2,2],[2,14,2,15],[3,6,3,9],[3,10,3,12],[3,14,3,15],[5,12,5,13],[6,12,6,13],[7,1,7,3],[7,6,7,9],[7,12,7,13],[8,1,8,3],[8,6,8,9],[8,12,11,13],[9,1,9,3],[9,6,9,9],[10,6,10,9],[14,1,14,15],[20,1,20,15],[26,1,26,15],[32,1,32,15]]}
[]
[null,"Selectiontool",{"$nulls":4},"Taal/Language/Sprache/Språk/Jazyk",0,0,0,"Nederlands"]
[null,"Briza 12"]
[{"$nulls":6},{"$f":"IF(cal!$S$7=1,\"Uitvoering\",IF(cal!$S$7=2,\"Version\",IF(cal!$S$7=3,\"Ausführung\",IF(cal!$S$7=4,\"Version\",IF(cal!$S$7=5,\"Modell\",IF(cal!$S$7=6,\"Montaje\",IF(cal!$S$7=7,\"Version\",IF(cal!$S$7=8,\"Verze\",IF(cal!$S$7=9,\"ExtraTaal1\",IF(cal!$S$7=10,\"ExtraTaal2\",IF(cal!$S$7=11,\"ExtraTaal3\",)))))))))))","v":"Uitvoering"},{"$nulls":3},"Briza 12 H41 2P casing"]
[]
[null,{"$f":"cal!B7","v":"Temperaturen"},{"$nulls":10},{"$f":"cal!M7","v":"h_atm"},0]
[null,{"$f":"cal!B8","v":"Verwarmen:"},{"$nulls":4},{"$f":"cal!G8","v":"Koelen:"},{"$nulls":5},0,0,{"$f":"IF(UnitsNo=1,\"m\",IF(UnitsNo=2,\"ft\"))","v":"m"}]
[null,{"$f":"cal!B9","v":"Water aanvoer"},{"$f":"cal!C9","v":0},{"$f":"cal!D9","v":0},75,{"$f":"cal!F9","v":"°C"},{"$f":"cal!G9","v":"Water aanvoer"},{"$f":"cal!H9","v":0},{"$f":"cal!I9","v":0},{"$f":"cal!J9","v":0},8,{"$f":"cal!L9","v":"°C"},{"$f":"cal!M9","v":"Eenheidsstelsel"}]
[null,{"$f":"cal!B10","v":"Water retour"},{"$f":"cal!C10","v":0},{"$f":"cal!D10","v":0},65,{"$f":"cal!F10","v":"°C"},{"$f":"cal!G10","v":"Water retour"},{"$f":"cal!H10","v":0},{"$f":"cal!I10","v":0},{"$f":"cal!J10","v":0},14,{"$f":"cal!L10","v":"°C"}]
[null,{"$f":"cal!B11","v":"Ruimte"},{"$f":"cal!C11","v":0},{"$f":"cal!D11","v":0},20,{"$f":"cal!F11","v":"°C"},{"$f":"cal!G11","v":"Ruimte"},{"$f":"cal!H11","v":0},{"$f":"cal!I11","v":0},{"$f":"cal!J11","v":0},25,{"$f":"cal!L11","v":"°C"}]
[{"$nulls":6},{"$f":"cal!G12","v":"Relatieve vochtigheid"},{"$nulls":3},{"v":0.5,"d":"50%"}]
[]
[{"$nulls":3},{"$f":"cal!D14","v":{"v":1,"d":"1.0000"}},{"$f":"cal!E14","v":{"v":1,"d":"1.0000"}},{"$f":"cal!F14","v":{"v":1,"d":"1.0000"}},{"$f":"cal!G14","v":{"v":1,"d":"1.0000"}},{"$f":"cal!H14","v":{"v":1,"d":"1.0000"}},{"$f":"cal!I14","v":{"v":1,"d":"1.0000"}},{"$f":"cal!J14","v":{"v":1,"d":"1.0000"}},{"$f":"cal!K14","v":0.000334444444444444},{"$f":"cal!L14","v":0},{"$f":"cal!M14","v":1},{"$f":"cal!N14","v":{"v":1,"d":"1.0000"}}]
[null,{"$f":"cal!B15","v":"Snelheidsniveau"},{"$f":"cal!C15","v":"Stuurspanning [V]"},{"$f":"cal!D15","v":"Warmteafgifte  75/65/20 [W]"},{"$f":"cal!E15","v":"Waterdebiet, verwarming [l/h]"},{"$f":"cal!F15","v":"Waterzijdig drukverlies [kPa]"},{"$f":"cal!G15","v":"Voelb. Koelcapaciteit  8/14/25 [W]"},{"$f":"cal!H15","v":"Tot. koelcapaciteit 8/14/25 [W]"},{"$f":"cal!I15","v":"Waterdebiet, koeling [l/h]"},{"$f":"cal!J15","v":"Waterzijdig drukverlies [kPa]"},{"$f":"cal!K15","v":"Geluidsdruk ** [dB(A)]"},{"$f":"cal!L15","v":"Geluidsvermogen * [dB(A)]"},{"$f":"cal!M15","v":"Opgenomen elektr. vermogen [W]"},{"$f":"cal!N15","v":"Luchtdebiet [m³/h]"},{"$f":"cal!O15","v":"Uitblaastemp. verwarming  [°C]"},{"$f":"cal!P15","v":"Uitblaastemp. koeling  [°C]"}]
[null,{"$f":"cal!B16","v":"Briza 12 hoogte 41 cm breedte 14 cm lengte 75 cm (Type 1)"}]
[null,{"$f":"cal!B17","v":{"v":0.2,"d":"20%"}},{"$f":"cal!C17","v":2},{"$f":"IF($E$8<=$E$9,cal!$Z$3,cal!D17)","v":{"v":902.6320146734022,"d":"903"}},{"$f":"IF($E$8<=$E$9,\"\",cal!E17)","v":78},{"$f":"IF($E$8<=$E$9,\"\",cal!F17)","v":{"v":0.18531046187992548,"d":"0.19"}},{"$f":"IF($K$8>=$K$9,cal!$Z$3,cal!G17)","v":{"v":159.54351779103268,"d":"160"}},{"$f":"IF($K$8>=$K$9,\"\",cal!H17)","v":{"v":194.56512269372098,"d":"195"}},{"$f":"IF($K$8>=$K$9,\"\",cal!I17)","v":28},{"$f":"IF($K$8>=$K$9,\"\",cal!J17)","v":{"v":0.02825334052634823,"d":"0.03"}},{"$f":"cal!K17","v":18.5},{"$f":"cal!L17","v":26.5},{"$f":"cal!M17","v":1.6},{"$f":"cal!N17","v":64},{"$f":"IF($E$8<=$E$9,\"\",cal!O17)","v":{"v":49.535036178529445,"d":"49.5"}},{"$f":"IF($K$8>=$K$9,\"\",cal!P17)","v":{"v":17.59069926310443,"d":"17.6"}}]
[null,{"$f":"cal!B18","v":{"v":0.4,"d":"40%"}},{"$f":"cal!C18","v":4},{"$f":"IF($E$8<=$E$9,cal!$Z$4,cal!D18)","v":{"v":1034.5570615128618,"d":"1035"}},{"$f":"IF($E$8<=$E$9,\"\",cal!E18)","v":89},{"$f":"IF($E$8<=$E$9,\"\",cal!F18)","v":{"v":0.2360939438701031,"d":"0.24"}},{"$f":"IF($K$8>=$K$9,cal!$Z$5,cal!G18)","v":{"v":186.22089368908536,"d":"186"}},{"$f":"IF($K$8>=$K$9,\"\",cal!H18)","v":{"v":223.30589330196105,"d":"223"}},{"$f":"IF($K$8>=$K$9,\"\",cal!I18)","v":32},{"$f":"IF($K$8>=$K$9,\"\",cal!J18)","v":{"v":0.036102181928819276,"d":"0.04"}},{"$f":"cal!K18","v":29.4},{"$f":"cal!L18","v":37.4},{"$f":"cal!M18","v":2.6},{"$f":"cal!N18","v":101},{"$f":"IF($E$8<=$E$9,\"\",cal!O18)","v":{"v":45.40019276549573,"d":"45.4"}},{"$f":"IF($K$8>=$K$9,\"\",cal!P18)","v":{"v":19.519943124707005,"d":"19.5"}}]
[null,{"$f":"cal!B19","v":{"v":0.6,"d":"60%"}},{"$f":"cal!C19","v":6},{"$f":"IF($E$8<=$E$9,\"\",cal!D19)","v":{"v":1194.3093068594899,"d":"1194"}},{"$f":"IF($E$8<=$E$9,\"\",cal!E19)","v":103},{"$f":"IF($E$8<=$E$9,\"\",cal!F19)","v":{"v":0.3087190798567941,"d":"0.31"}},{"$f":"IF($K$8>=$K$9,\"\",cal!G19)","v":{"v":219.1973665744931,"d":"219"}},{"$f":"IF($K$8>=$K$9,\"\",cal!H19)","v":{"v":258.53193713791353,"d":"259"}},{"$f":"IF($K$8>=$K$9,\"\",cal!I19)","v":37},{"$f":"IF($K$8>=$K$9,\"\",cal!J19)","v":{"v":0.04712876427813621,"d":"0.05"}},{"$f":"cal!K19","v":{"v":31.299999999999997,"d":"31.3"}},{"$f":"cal!L19","v":39.3},{"$f":"cal!M19","v":4.3},{"$f":"cal!N19","v":141},{"$f":"IF($E$8<=$E$9,\"\",cal!O19)","v":{"v":45.17536275651017,"d":"45.2"}},{"$f":"IF($K$8>=$K$9,\"\",cal!P19)","v":{"v":20.379443844998995,"d":"20.4"}}]
[null,{"$f":"cal!B20","v":{"v":0.8,"d":"80%"}},{"$f":"cal!C20","v":8},{"$f":"IF($E$8<=$E$9,\"\",cal!D20)","v":{"v":1399.1815197239785,"d":"1399"}},{"$f":"IF($E$8<=$E$9,\"\",cal!E20)","v":120},{"$f":"IF($E$8<=$E$9,\"\",cal!F20)","v":{"v":0.4086581345410091,"d":"0.41"}},{"$f":"IF($K$8>=$K$9,\"\",cal!G20)","v":{"v":256.4749031831965,"d":"256"}},{"$f":"IF($K$8>=$K$9,\"\",cal!H20)","v":{"v":297.6103462364294,"d":"298"}},{"$f":"IF($K$8>=$K$9,\"\",cal!I20)","v":43},{"$f":"IF($K$8>=$K$9,\"\",cal!J20)","v":{"v":0.06210191655139985,"d":"0.06"}},{"$f":"cal!K20","v":37.3},{"$f":"cal!L20","v":45.3},{"$f":"cal!M20","v":7.2},{"$f":"cal!N20","v":178},{"$f":"IF($E$8<=$E$9,\"\",cal!O20)","v":{"v":47.69950606055594,"d":"47.7"}},{"$f":"IF($K$8>=$K$9,\"\",cal!P20)","v":{"v":20.717445432580575,"d":"20.7"}}]
[null,{"$f":"cal!B21","v":{"v":1,"d":"100%"}},{"$f":"cal!C21","v":10},{"$f":"IF($E$8<=$E$9,\"\",cal!D21)","v":{"v":1669.3181923753664,"d":"1669"}},{"$f":"IF($E$8<=$E$9,\"\",cal!E21)","v":144},{"$f":"IF($E$8<=$E$9,\"\",cal!F21)","v":{"v":0.5711153747379181,"d":"0.57"}},{"$f":"IF($K$8>=$K$9,\"\",cal!G21)","v":{"v":296.0554702511363,"d":"296"}},{"$f":"IF($K$8>=$K$9,\"\",cal!H21)","v":{"v":338.0757017152491,"d":"338"}},{"$f":"IF($K$8>=$K$9,\"\",cal!I21)","v":48},{"$f":"IF($K$8>=$K$9,\"\",cal!J21)","v":{"v":0.07599901238765913,"d":"0.08"}},{"$f":"cal!K21","v":42.5},{"$f":"cal!L21","v":50.5},{"$f":"cal!M21","v":{"v":13,"d":"13.0"}},{"$f":"cal!N21","v":214},{"$f":"IF($E$8<=$E$9,\"\",cal!O21)","v":{"v":51.82176206840366,"d":"51.8"}},{"$f":"IF($K$8>=$K$9,\"\",cal!P21)","v":{"v":20.88814918070638,"d":"20.9"}}]
[null,{"$f":"cal!B22","v":"Briza 12 hoogte 41 cm breedte 14 cm lengte 95 cm (Type 2)"}]
[null,{"$f":"cal!B23","v":{"v":0.2,"d":"20%"}},{"$f":"cal!C23","v":2},{"$f":"IF($E$8<=$E$9,cal!$Z$3,cal!D23)","v":{"v":1545.0574900003676,"d":"1545"}},{"$f":"IF($E$8<=$E$9,\"\",cal!E23)","v":133},{"$f":"IF($E$8<=$E$9,\"\",cal!F23)","v":{"v":0.6373680078471634,"d":"0.64"}},{"$f":"IF($K$8>=$K$9,cal!$Z$3,cal!G23)","v":{"v":264.48417906365233,"d":"264"}},{"$f":"IF($K$8>=$K$9,\"\",cal!H23)","v":{"v":322.5414448831961,"d":"323"}},{"$f":"IF($K$8>=$K$9,\"\",cal!I23)","v":46},{"$f":"IF($K$8>=$K$9,\"\",cal!J23)","v":{"v":0.09280957156128374,"d":"0.09"}},{"$f":"cal!K23","v":{"v":24,"d":"24.0"}},{"$f":"cal!L23","v":{"v":32,"d":"32.0"}},{"$f":"cal!M23","v":2.5},{"$f":"cal!N23","v":108},{"$f":"IF($E$8<=$E$9,\"\",cal!O23)","v":{"v":50.016443751673116,"d":"50.0"}},{"$f":"IF($K$8>=$K$9,\"\",cal!P23)","v":{"v":17.72129738007028,"d":"17.7"}}]
[null,{"$f":"cal!B24","v":{"v":0.4,"d":"40%"}},{"$f":"cal!C24","v":4},{"$f":"IF($E$8<=$E$9,cal!$Z$4,cal!D24)","v":{"v":1699.4501618638099,"d":"1699"}},{"$f":"IF($E$8<=$E$9,\"\",cal!E24)","v":146},{"$f":"IF($E$8<=$E$9,\"\",cal!F24)","v":{"v":0.7549049202104832,"d":"0.75"}},{"$f":"IF($K$8>=$K$9,cal!$Z$5,cal!G24)","v":{"v":300.4609972000166,"d":"300"}},{"$f":"IF($K$8>=$K$9,\"\",cal!H24)","v":{"v":360.2963666051842,"d":"360"}},{"$f":"IF($K$8>=$K$9,\"\",cal!I24)","v":52},{"$f":"IF($K$8>=$K$9,\"\",cal!J24)","v":{"v":0.11593731452928037,"d":"0.12"}},{"$f":"cal!K24","v":{"v":30,"d":"30.0"}},{"$f":"cal!L24","v":{"v":38,"d":"38.0"}},{"$f":"cal!M24","v":4.3},{"$f":"cal!N24","v":172},{"$f":"IF($E$8<=$E$9,\"\",cal!O24)","v":{"v":44.43020481587197,"d":"44.4"}},{"$f":"IF($K$8>=$K$9,\"\",cal!P24)","v":{"v":19.807964054504478,"d":"19.8"}}]
[null,{"$f":"cal!B25","v":{"v":0.6,"d":"60%"}},{"$f":"cal!C25","v":6},{"$f":"IF($E$8<=$E$9,\"\",cal!D25)","v":{"v":1797.2271053057073,"d":"1797"}},{"$f":"IF($E$8<=$E$9,\"\",cal!E25)","v":155},{"$f":"IF($E$8<=$E$9,\"\",cal!F25)","v":{"v":0.8414705280809154,"d":"0.84"}},{"$f":"IF($K$8>=$K$9,\"\",cal!G25)","v":{"v":348.93644722168705,"d":"349"}},{"$f":"IF($K$8>=$K$9,\"\",cal!H25)","v":{"v":411.5524609078105,"d":"412"}},{"$f":"IF($K$8>=$K$9,\"\",cal!I25)","v":59},{"$f":"IF($K$8>=$K$9,\"\",cal!J25)","v":{"v":0.14580188147753229,"d":"0.15"}},{"$f":"cal!K25","v":36.8},{"$f":"cal!L25","v":44.8},{"$f":"cal!M25","v":7.2},{"$f":"cal!N25","v":223},{"$f":"IF($E$8<=$E$9,\"\",cal!O25)","v":{"v":43.9538943621044,"d":"44.0"}},{"$f":"IF($K$8>=$K$9,\"\",cal!P25)","v":{"v":20.349287370994467,"d":"20.3"}}]
[null,{"$f":"cal!B26","v":{"v":0.8,"d":"80%"}},{"$f":"cal!C26","v":8},{"$f":"IF($E$8<=$E$9,\"\",cal!D26)","v":{"v":2243.0259004586364,"d":"2243"}},{"$f":"IF($E$8<=$E$9,\"\",cal!E26)","v":193},{"$f":"IF($E$8<=$E$9,\"\",cal!F26)","v":{"v":1.2527236220879372,"d":"1.25"}},{"$f":"IF($K$8>=$K$9,\"\",cal!G26)","v":{"v":410.8907276404598,"d":"411"}},{"$f":"IF($K$8>=$K$9,\"\",cal!H26)","v":{"v":476.792583604443,"d":"477"}},{"$f":"IF($K$8>=$K$9,\"\",cal!I26)","v":68},{"$f":"IF($K$8>=$K$9,\"\",cal!J26)","v":{"v":0.18865080689357502,"d":"0.19"}},{"$f":"cal!K26","v":41.5},{"$f":"cal!L26","v":49.5},{"$f":"cal!M26","v":11.5},{"$f":"cal!N26","v":287},{"$f":"IF($E$8<=$E$9,\"\",cal!O26)","v":{"v":47.551894755698086,"d":"47.6"}},{"$f":"IF($K$8>=$K$9,\"\",cal!P26)","v":{"v":20.74477550550455,"d":"20.7"}}]
[null,{"$f":"cal!B27","v":{"v":1,"d":"100%"}},{"$f":"cal!C27","v":10},{"$f":"IF($E$8<=$E$9,\"\",cal!D27)","v":{"v":2749.2183050241524,"d":"2749"}},{"$f":"IF($E$8<=$E$9,\"\",cal!E27)","v":236},{"$f":"IF($E$8<=$E$9,\"\",cal!F27)","v":{"v":1.8046268223295128,"d":"1.80"}},{"$f":"IF($K$8>=$K$9,\"\",cal!G27)","v":{"v":487.30403696813084,"d":"487"}},{"$f":"IF($K$8>=$K$9,\"\",cal!H27)","v":{"v":556.4688742515888,"d":"556"}},{"$f":"IF($K$8>=$K$9,\"\",cal!I27)","v":80},{"$f":"IF($K$8>=$K$9,\"\",cal!J27)","v":{"v":0.25336690219813474,"d":"0.25"}},{"$f":"cal!K27","v":44.5},{"$f":"cal!L27","v":52.5},{"$f":"cal!M27","v":{"v":18,"d":"18.0"}},{"$f":"cal!N27","v":346},{"$f":"IF($E$8<=$E$9,\"\",cal!O27)","v":{"v":52.339514593980184,"d":"52.3"}},{"$f":"IF($K$8>=$K$9,\"\",cal!P27)","v":{"v":20.81397378722577,"d":"20.8"}}]
[null,{"$f":"cal!B28","v":"Briza 12 hoogte 41 cm breedte 14 cm lengte 125 cm (Type 3)"}]
[null,{"$f":"cal!B29","v":{"v":0.2,"d":"20%"}},{"$f":"cal!C29","v":2},{"$f":"IF($E$8<=$E$9,cal!$Z$3,cal!D29)","v":{"v":2430.7625854019607,"d":"2431"}},{"$f":"IF($E$8<=$E$9,\"\",cal!E29)","v":209},{"$f":"IF($E$8<=$E$9,\"\",cal!F29)","v":{"v":1.9543348859943828,"d":"1.95"}},{"$f":"IF($K$8>=$K$9,cal!$Z$3,cal!G29)","v":{"v":433.432567511191,"d":"433"}},{"$f":"IF($K$8>=$K$9,\"\",cal!H29)","v":{"v":528.575913612012,"d":"529"}},{"$f":"IF($K$8>=$K$9,\"\",cal!I29)","v":76},{"$f":"IF($K$8>=$K$9,\"\",cal!J29)","v":{"v":0.311747050009198,"d":"0.31"}},{"$f":"cal!K29","v":24.6},{"$f":"cal!L29","v":32.6},{"$f":"cal!M29","v":2.6},{"$f":"cal!N29","v":146},{"$f":"IF($E$8<=$E$9,\"\",cal!O29)","v":{"v":55.587466361196896,"d":"55.6"}},{"$f":"IF($K$8>=$K$9,\"\",cal!P29)","v":{"v":16.1763815966425,"d":"16.2"}}]
[null,{"$f":"cal!B30","v":{"v":0.4,"d":"40%"}},{"$f":"cal!C30","v":4},{"$f":"IF($E$8<=$E$9,cal!$Z$4,cal!D30)","v":{"v":2716.94544387916,"d":"2717"}},{"$f":"IF($E$8<=$E$9,\"\",cal!E30)","v":234},{"$f":"IF($E$8<=$E$9,\"\",cal!F30)","v":{"v":2.399047177794451,"d":"2.40"}},{"$f":"IF($K$8>=$K$9,cal!$Z$5,cal!G30)","v":{"v":479.841731112975,"d":"480"}},{"$f":"IF($K$8>=$K$9,\"\",cal!H30)","v":{"v":575.3999150527252,"d":"575"}},{"$f":"IF($K$8>=$K$9,\"\",cal!I30)","v":82},{"$f":"IF($K$8>=$K$9,\"\",cal!J30)","v":{"v":0.3578354698326758,"d":"0.36"}},{"$f":"cal!K30","v":{"v":30.200000000000003,"d":"30.2"}},{"$f":"cal!L30","v":38.2},{"$f":"cal!M30","v":4.8},{"$f":"cal!N30","v":221},{"$f":"IF($E$8<=$E$9,\"\",cal!O30)","v":{"v":50.885858725701176,"d":"50.9"}},{"$f":"IF($K$8>=$K$9,\"\",cal!P30)","v":{"v":18.54667147516013,"d":"18.5"}}]
[null,{"$f":"cal!B31","v":{"v":0.6,"d":"60%"}},{"$f":"cal!C31","v":6},{"$f":"IF($E$8<=$E$9,\"\",cal!D31)","v":{"v":3089.5460115724723,"d":"3090"}},{"$f":"IF($E$8<=$E$9,\"\",cal!E31)","v":266},{"$f":"IF($E$8<=$E$9,\"\",cal!F31)","v":{"v":3.0272467676397294,"d":"3.03"}},{"$f":"IF($K$8>=$K$9,\"\",cal!G31)","v":{"v":547.619069812628,"d":"548"}},{"$f":"IF($K$8>=$K$9,\"\",cal!H31)","v":{"v":645.8883203973475,"d":"646"}},{"$f":"IF($K$8>=$K$9,\"\",cal!I31)","v":93},{"$f":"IF($K$8>=$K$9,\"\",cal!J31)","v":{"v":0.44965960948814393,"d":"0.45"}},{"$f":"cal!K31","v":{"v":37,"d":"37.0"}},{"$f":"cal!L31","v":{"v":45,"d":"45.0"}},{"$f":"cal!M31","v":{"v":8,"d":"8.0"}},{"$f":"cal!N31","v":298},{"$f":"IF($E$8<=$E$9,\"\",cal!O31)","v":{"v":50.81459303683383,"d":"50.8"}},{"$f":"IF($K$8>=$K$9,\"\",cal!P31)","v":{"v":19.53814291411151,"d":"19.5"}}]
[null,{"$f":"cal!B32","v":{"v":0.8,"d":"80%"}},{"$f":"cal!C32","v":8},{"$f":"IF($E$8<=$E$9,\"\",cal!D32)","v":{"v":3617.002335112651,"d":"3617"}},{"$f":"IF($E$8<=$E$9,\"\",cal!E32)","v":311},{"$f":"IF($E$8<=$E$9,\"\",cal!F32)","v":{"v":4.019926040404012,"d":"4.02"}},{"$f":"IF($K$8>=$K$9,\"\",cal!G32)","v":{"v":643.1184805911148,"d":"643"}},{"$f":"IF($K$8>=$K$9,\"\",cal!H32)","v":{"v":746.266832755385,"d":"746"}},{"$f":"IF($K$8>=$K$9,\"\",cal!I32)","v":107},{"$f":"IF($K$8>=$K$9,\"\",cal!J32)","v":{"v":0.5799522528835347,"d":"0.58"}},{"$f":"cal!K32","v":42.5},{"$f":"cal!L32","v":50.5},{"$f":"cal!M32","v":{"v":14,"d":"14.0"}},{"$f":"cal!N32","v":381},{"$f":"IF($E$8<=$E$9,\"\",cal!O32)","v":{"v":53.03805738533397,"d":"53.0"}},{"$f":"IF($K$8>=$K$9,\"\",cal!P32)","v":{"v":19.98300062347721,"d":"20.0"}}]
[null,{"$f":"cal!B33","v":{"v":1,"d":"100%"}},{"$f":"cal!C33","v":10},{"$f":"IF($E$8<=$E$9,\"\",cal!D33)","v":{"v":4366.739210456259,"d":"4367"}},{"$f":"IF($E$8<=$E$9,\"\",cal!E33)","v":375},{"$f":"IF($E$8<=$E$9,\"\",cal!F33)","v":{"v":5.64532763428131,"d":"5.65"}},{"$f":"IF($K$8>=$K$9,\"\",cal!G33)","v":{"v":772.6938604293996,"d":"773"}},{"$f":"IF($K$8>=$K$9,\"\",cal!H33)","v":{"v":882.3651150716456,"d":"882"}},{"$f":"IF($K$8>=$K$9,\"\",cal!I33)","v":126},{"$f":"IF($K$8>=$K$9,\"\",cal!J33)","v":{"v":0.780193209619803,"d":"0.78"}},{"$f":"cal!K33","v":{"v":47,"d":"47.0"}},{"$f":"cal!L33","v":{"v":55,"d":"55.0"}},{"$f":"cal!M33","v":{"v":24,"d":"24.0"}},{"$f":"cal!N33","v":448},{"$f":"IF($E$8<=$E$9,\"\",cal!O33)","v":{"v":58.76470280191157,"d":"58.8"}},{"$f":"IF($K$8>=$K$9,\"\",cal!P33)","v":{"v":19.87365913098134,"d":"19.9"}}]
[null,{"$f":"cal!B34","v":"Briza 12 hoogte 41 cm breedte 14 cm lengte 145 cm (Type 4)"}]
[null,{"$f":"cal!B35","v":{"v":0.2,"d":"20%"}},{"$f":"cal!C35","v":2},{"$f":"IF($E$8<=$E$9,cal!$Z$3,cal!D35)","v":{"v":2998.699248841798,"d":"2999"}},{"$f":"IF($E$8<=$E$9,\"\",cal!E35)","v":258},{"$f":"IF($E$8<=$E$9,\"\",cal!F35)","v":{"v":3.336914580405293,"d":"3.34"}},{"$f":"IF($K$8>=$K$9,cal!$Z$3,cal!G35)","v":{"v":569.1758572106166,"d":"569"}},{"$f":"IF($K$8>=$K$9,\"\",cal!H35)","v":{"v":694.1163892194924,"d":"694"}},{"$f":"IF($K$8>=$K$9,\"\",cal!I35)","v":99},{"$f":"IF($K$8>=$K$9,\"\",cal!J35)","v":{"v":0.5785915375680388,"d":"0.58"}},{"$f":"cal!K35","v":{"v":25.700000000000003,"d":"25.7"}},{"$f":"cal!L35","v":33.7},{"$f":"cal!M35","v":2.8},{"$f":"cal!N35","v":173},{"$f":"IF($E$8<=$E$9,\"\",cal!O35)","v":{"v":57.21495479652375,"d":"57.2"}},{"$f":"IF($K$8>=$K$9,\"\",cal!P35)","v":{"v":15.221361297207142,"d":"15.2"}}]
[null,{"$f":"cal!B36","v":{"v":0.4,"d":"40%"}},{"$f":"cal!C36","v":4},{"$f":"IF($E$8<=$E$9,cal!$Z$4,cal!D36)","v":{"v":3401.114332986619,"d":"3401"}},{"$f":"IF($E$8<=$E$9,\"\",cal!E36)","v":292},{"$f":"IF($E$8<=$E$9,\"\",cal!F36)","v":{"v":4.18500164484905,"d":"4.19"}},{"$f":"IF($K$8>=$K$9,cal!$Z$5,cal!G36)","v":{"v":622.7507831374619,"d":"623"}},{"$f":"IF($K$8>=$K$9,\"\",cal!H36)","v":{"v":746.7686207391317,"d":"747"}},{"$f":"IF($K$8>=$K$9,\"\",cal!I36)","v":107},{"$f":"IF($K$8>=$K$9,\"\",cal!J36)","v":{"v":0.6669747274765027,"d":"0.67"}},{"$f":"cal!K36","v":30.5},{"$f":"cal!L36","v":38.5},{"$f":"cal!M36","v":5.5},{"$f":"cal!N36","v":268},{"$f":"IF($E$8<=$E$9,\"\",cal!O36)","v":{"v":51.947436146240086,"d":"51.9"}},{"$f":"IF($K$8>=$K$9,\"\",cal!P36)","v":{"v":18.093507867066993,"d":"18.1"}}]
[null,{"$f":"cal!B37","v":{"v":0.6,"d":"60%"}},{"$f":"cal!C37","v":6},{"$f":"IF($E$8<=$E$9,\"\",cal!D37)","v":{"v":3894.37903261701,"d":"3894"}},{"$f":"IF($E$8<=$E$9,\"\",cal!E37)","v":335},{"$f":"IF($E$8<=$E$9,\"\",cal!F37)","v":{"v":5.380678553716439,"d":"5.38"}},{"$f":"IF($K$8>=$K$9,\"\",cal!G37)","v":{"v":698.2752551836385,"d":"698"}},{"$f":"IF($K$8>=$K$9,\"\",cal!H37)","v":{"v":823.5794854622305,"d":"824"}},{"$f":"IF($K$8>=$K$9,\"\",cal!I37)","v":118},{"$f":"IF($K$8>=$K$9,\"\",cal!J37)","v":{"v":0.7977240241262115,"d":"0.80"}},{"$f":"cal!K37","v":37.3},{"$f":"cal!L37","v":45.3},{"$f":"cal!M37","v":10.3},{"$f":"cal!N37","v":373},{"$f":"IF($E$8<=$E$9,\"\",cal!O37)","v":{"v":51.03183230080132,"d":"51.0"}},{"$f":"IF($K$8>=$K$9,\"\",cal!P37)","v":{"v":19.435888125636147,"d":"19.4"}}]
[null,{"$f":"cal!B38","v":{"v":0.8,"d":"80%"}},{"$f":"cal!C38","v":8},{"$f":"IF($E$8<=$E$9,\"\",cal!D38)","v":{"v":4551.062918931729,"d":"4551"}},{"$f":"IF($E$8<=$E$9,\"\",cal!E38)","v":391},{"$f":"IF($E$8<=$E$9,\"\",cal!F38)","v":{"v":7.139101377160831,"d":"7.14"}},{"$f":"IF($K$8>=$K$9,\"\",cal!G38)","v":{"v":808.1174092312896,"d":"808"}},{"$f":"IF($K$8>=$K$9,\"\",cal!H38)","v":{"v":937.7295750033742,"d":"938"}},{"$f":"IF($K$8>=$K$9,\"\",cal!I38)","v":134},{"$f":"IF($K$8>=$K$9,\"\",cal!J38)","v":{"v":1.0066381571087277,"d":"1.01"}},{"$f":"cal!K38","v":{"v":43,"d":"43.0"}},{"$f":"cal!L38","v":{"v":51,"d":"51.0"}},{"$f":"cal!M38","v":18.5},{"$f":"cal!N38","v":466},{"$f":"IF($E$8<=$E$9,\"\",cal!O38)","v":{"v":53.9299060962134,"d":"53.9"}},{"$f":"IF($K$8>=$K$9,\"\",cal!P38)","v":{"v":19.84573694878792,"d":"19.8"}}]
[null,{"$f":"cal!B39","v":{"v":1,"d":"100%"}},{"$f":"cal!C39","v":10},{"$f":"IF($E$8<=$E$9,\"\",cal!D39)","v":{"v":5443.735563129534,"d":"5444"}},{"$f":"IF($E$8<=$E$9,\"\",cal!E39)","v":468},{"$f":"IF($E$8<=$E$9,\"\",cal!F39)","v":{"v":9.9187672702891,"d":"9.92"}},{"$f":"IF($K$8>=$K$9,\"\",cal!G39)","v":{"v":964.6453811625582,"d":"965"}},{"$f":"IF($K$8>=$K$9,\"\",cal!H39)","v":{"v":1101.5610144486232,"d":"1102"}},{"$f":"IF($K$8>=$K$9,\"\",cal!I39)","v":158},{"$f":"IF($K$8>=$K$9,\"\",cal!J39)","v":{"v":1.3607117905256103,"d":"1.36"}},{"$f":"cal!K39","v":{"v":47,"d":"47.0"}},{"$f":"cal!L39","v":{"v":55,"d":"55.0"}},{"$f":"cal!M39","v":28.8},{"$f":"cal!N39","v":510},{"$f":"IF($E$8<=$E$9,\"\",cal!O39)","v":{"v":62.07028461878008,"d":"62.1"}},{"$f":"IF($K$8>=$K$9,\"\",cal!P39)","v":{"v":19.3781979930313,"d":"19.4"}}]
[null,{"$f":"cal!B40","v":"*Geluidsvermogen gemeten volgens ISO 3741:2010"},{"$nulls":13},"v2021-04-26"]
[null,{"$f":"cal!B41","v":"**Geluidsdruk bij een aangenomen ruimtedemping van 8 dB(A)"}]

{"sheet":"cal","index":1,"n_rows":41,"n_cols":86,"rows_kept":41,"hidden":true,"merged":[[2,6,2,9],[4,6,4,9],[6,12,6,13],[7,12,7,13],[8,1,8,3],[8,6,8,9],[8,12,8,13],[9,1,9,3],[9,6,9,9],[10,1,10,3],[10,6,10,9],[15,1,15,15],[15,22,15,28],[15,30,15,36],[15,37,15,43],[15,44,15,50],[15,51,15,57],[15,58,15,64],[15,65,15,71],[15,72,15,78],[15,79,15,85],[21,1,21,15],[27,1,27,15],[33,1,33,15]]}
[{"$nulls":4},"Nederlands","English","Deutsch","Français","Norsk","Español","Svenska","Čeština","ExtraTaal1","ExtraTaal2","ExtraTaal3",{"$nulls":8},"Briza 12"]
[{"$nulls":23},"Briza 12 H38 2P built-in"]
[null,{"$f":"IF($S$7=1,NL!B3,IF(cal!$S$7=2,EN!B3,IF(cal!$S$7=3,DE!B3,IF(cal!$S$7=4,FR!B3,IF(cal!$S$7=5,NR!B3,IF(cal!$S$7=6,SP!B3,IF(cal!$S$7=7,SW!B3,IF(cal!$S$7=8,TS!B3,IF(cal!$S$7=9,ExtraTaal1!B3,IF(cal!$S$7=10,ExtraTaal2!B3,IF(cal!$S$7=11,ExtraTaal3!B3,)))))))))))","v":"Invulformulier"},{"$nulls":21},"Briza 12 H38 4P built-in",null,{"$f":"IF($S$7=1,NL!R16,IF(cal!$S$7=2,EN!R16,IF(cal!$S$7=3,DE!R16,IF(cal!$S$7=4,FR!R16,IF(cal!$S$7=5,NR!R16,IF(cal!$S$7=6,SP!R16,IF(cal!$S$7=7,SW!R16,IF(cal!$S$7=8,TS!R16,IF(cal!$S$7=9,ExtraTaal1!R16,IF(cal!$S$7=10,ExtraTaal2!R16,IF(cal!$S$7=11,ExtraTaal3!R16,)))))))))))","v":"Temp."},{"$f":"IF($S$7=1,NL!Q7,IF(cal!$S$7=2,EN!Q7,IF(cal!$S$7=3,DE!Q7,IF(cal!$S$7=4,FR!Q7,IF(cal!$S$7=5,NR!Q7,IF(cal!$S$7=6,SP!Q7,IF(cal!$S$7=7,SW!Q7,IF(cal!$S$7=8,TS!Q7,IF(cal!$S$7=9,ExtraTaal1!Q7,IF(cal!$S$7=10,ExtraTaal2!Q7,IF(cal!$S$7=11,ExtraTaal3!Q7,)))))))))))","v":"Kopieer alle data"}]
[{"$nulls":22},1,"Briza 12 H41 2P casing",null,{"$f":"IF($S$7=1,NL!R17,IF(cal!$S$7=2,EN!R17,IF(cal!$S$7=3,DE!R17,IF(cal!$S$7=4,FR!R17,IF(cal!$S$7=5,NR!R17,IF(cal!$S$7=6,SP!R17,IF(cal!$S$7=7,SW!R17,IF(cal!$S$7=8,TS!R17,IF(cal!$S$7=9,ExtraTaal1!R17,IF(cal!$S$7=10,ExtraTaal2!R17,IF(cal!$S$7=11,ExtraTaal3!R17,)))))))))))","v":"verw.!"},{"$f":"IF($S$7=1,NL!Q8,IF(cal!$S$7=2,EN!Q8,IF(cal!$S$7=3,DE!Q8,IF(cal!$S$7=4,FR!Q8,IF(cal!$S$7=5,NR!Q8,IF(cal!$S$7=6,SP!Q8,IF(cal!$S$7=7,SW!Q8,IF(cal!$S$7=8,TS!Q8,IF(cal!$S$7=9,ExtraTaal1!Q8,IF(cal!$S$7=10,ExtraTaal2!Q8,IF(cal!$S$7=11,ExtraTaal3!Q8,)))))))))))","v":"SI-eenheden"}]
[null,{"$f":"IF($S$7=1,NL!B5,IF(cal!$S$7=2,EN!B5,IF(cal!$S$7=3,DE!B5,IF(cal!$S$7=4,FR!B5,IF(cal!$S$7=5,NR!B5,IF(cal!$S$7=6,SP!B5,IF(cal!$S$7=7,SW!B5,IF(cal!$S$7=8,TS!B5,IF(cal!$S$7=9,ExtraTaal1!B5,IF(cal!$S$7=10,ExtraTaal2!B5,IF(cal!$S$7=11,ExtraTaal3!B5,)))))))))))","v":"Randvoorwaarden"},{"$nulls":21},"Briza 12 H41 4P casing",null,{"$f":"IF($S$7=1,NL!R18,IF(cal!$S$7=2,EN!R18,IF(cal!$S$7=3,DE!R18,IF(cal!$S$7=4,FR!R18,IF(cal!$S$7=5,NR!R18,IF(cal!$S$7=6,SP!R18,IF(cal!$S$7=7,SW!R18,IF(cal!$S$7=8,TS!R18,IF(cal!$S$7=9,ExtraTaal1!R18,IF(cal!$S$7=10,ExtraTaal2!R18,IF(cal!$S$7=11,ExtraTaal3!R18,)))))))))))","v":"koelen!"},{"$f":"IF($S$7=1,NL!Q9,IF(cal!$S$7=2,EN!Q9,IF(cal!$S$7=3,DE!Q9,IF(cal!$S$7=4,FR!Q9,IF(cal!$S$7=5,NR!Q9,IF(cal!$S$7=6,SP!Q9,IF(cal!$S$7=7,SW!Q9,IF(cal!$S$7=8,TS!Q9,IF(cal!$S$7=9,ExtraTaal1!Q9,IF(cal!$S$7=10,ExtraTaal2!Q9,IF(cal!$S$7=11,ExtraTaal3!Q9,)))))))))))","v":"Imperiale-eenheden"}]
[{"$nulls":23},"Briza 12 H52 2P built-in"]
[null,{"$f":"IF($S$7=1,NL!B7,IF(cal!$S$7=2,EN!B7,IF(cal!$S$7=3,DE!B7,IF(cal!$S$7=4,FR!B7,IF(cal!$S$7=5,NR!B7,IF(cal!$S$7=6,SP!B7,IF(cal!$S$7=7,SW!B7,IF(cal!$S$7=8,TS!B7,IF(cal!$S$7=9,ExtraTaal1!B7,IF(cal!$S$7=10,ExtraTaal2!B7,IF(cal!$S$7=11,ExtraTaal3!B7,)))))))))))","v":"Temperaturen"},{"$nulls":10},{"$f":"IF($S$7=8,\"Výška umístění\",\"h_atm\")","v":"h_atm"},{"$nulls":5},{"$f":"IF('Briza 12'!$K$2=cal!$E$1,1,IF('Briza 12'!$K$2=cal!$F$1,2,IF('Briza 12'!$K$2=cal!G1,3,IF('Briza 12'!$K$2=cal!H1,4,IF('Briza 12'!$K$2=cal!I1,5,IF('Briza 12'!$K$2=cal!J1,6,IF('Briza 12'!$K$2=cal!K1,7,IF('Briza 12'!$K$2=cal!L1,8,IF('Briza 12'!$K$2=cal!M1,9,IF('Briza 12'!$K$2=cal!N1,10,IF('Briza 12'!$K$2=cal!O1,11,)))))))))))","v":1},{"$nulls":4},"Briza 12 H52 4P built-in"]
[null,{"$f":"IF($S$7=1,NL!B8,IF(cal!$S$7=2,EN!B8,IF(cal!$S$7=3,DE!B8,IF(cal!$S$7=4,FR!B8,IF(cal!$S$7=5,NR!B8,IF(cal!$S$7=6,SP!B8,IF(cal!$S$7=7,SW!B8,IF(cal!$S$7=8,TS!B8,IF(cal!$S$7=9,ExtraTaal1!B8,IF(cal!$S$7=10,ExtraTaal2!B8,IF(cal!$S$7=11,ExtraTaal3!B8,)))))))))))","v":"Verwarmen:"},{"$nulls":4},{"$f":"IF($S$7=1,NL!G8,IF(cal!$S$7=2,EN!G8,IF(cal!$S$7=3,DE!G8,IF(cal!$S$7=4,FR!G8,IF(cal!$S$7=5,NR!G8,IF(cal!$S$7=6,SP!G8,IF(cal!$S$7=7,SW!G8,IF(cal!$S$7=8,TS!G8,IF(cal!$S$7=9,ExtraTaal1!G8,IF(cal!$S$7=10,ExtraTaal2!G8,IF(cal!$S$7=11,ExtraTaal3!G8,)))))))))))","v":"Koelen:"},{"$nulls":5},{"$f":"'Briza 12'!M7","v":{"v":0,"d":"0.00"}},{"$f":"'Briza 12'!N7","v":{"v":0,"d":"0.00"}},{"$nulls":4},"Temp",{"$nulls":3},"Temp","Briza 12 H55 2P casing"]
[null,{"$f":"IF($S$7=1,NL!B9,IF(cal!$S$7=2,EN!B9,IF(cal!$S$7=3,DE!B9,IF(cal!$S$7=4,FR!B9,IF(cal!$S$7=5,NR!B9,IF(cal!$S$7=6,SP!B9,IF(cal!$S$7=7,SW!B9,IF(cal!$S$7=8,TS!B9,IF(cal!$S$7=9,ExtraTaal1!B9,IF(cal!$S$7=10,ExtraTaal2!B9,IF(cal!$S$7=11,ExtraTaal3!B9,)))))))))))","v":"Water aanvoer"},{"$f":"IF($S$7=1,NL!C9,IF(cal!$S$7=2,EN!C9,IF(cal!$S$7=3,DE!C9,IF(cal!$S$7=4,FR!C9,IF(cal!$S$7=5,NR!C9,IF(cal!$S$7=6,SP!C9,IF(cal!$S$7=7,SW!C9,IF(cal!$S$7=8,TS!C9,IF(cal!$S$7=9,ExtraTaal1!C9,IF(cal!$S$7=10,ExtraTaal2!C9,IF(cal!$S$7=11,ExtraTaal3!C9,)))))))))))","v":0},{"$f":"IF($S$7=1,NL!D9,IF(cal!$S$7=2,EN!D9,IF(cal!$S$7=3,DE!D9,IF(cal!$S$7=4,FR!D9,IF(cal!$S$7=5,NR!D9,IF(cal!$S$7=6,SP!D9,IF(cal!$S$7=7,SW!D9,IF(cal!$S$7=8,TS!D9,IF(cal!$S$7=9,ExtraTaal1!D9,IF(cal!$S$7=10,ExtraTaal2!D9,IF(cal!$S$7=11,ExtraTaal3!D9,)))))))))))","v":0},{"$f":"'Briza 12'!E8","v":75},{"$f":"IF($W$4=1,\"°C\",IF($W$4=2,\"°F\",))","v":"°C"},{"$f":"B9","v":"Water aanvoer"},{"$f":"IF($S$7=1,NL!H9,IF(cal!$S$7=2,EN!H9,IF(cal!$S$7=3,DE!H9,IF(cal!$S$7=4,FR!H9,))))","v":0},{"$f":"IF($S$7=1,NL!I9,IF(cal!$S$7=2,EN!I9,IF(cal!$S$7=3,DE!I9,IF(cal!$S$7=4,FR!I9,))))","v":0},{"$f":"IF($S$7=1,NL!J9,IF(cal!$S$7=2,EN!J9,IF(cal!$S$7=3,DE!J9,IF(cal!$S$7=4,FR!J9,))))","v":0},{"$f":"'Briza 12'!K8","v":8},{"$f":"F9","v":"°C"},{"$f":"IF($S$7=1,NL!M9,IF(cal!$S$7=2,EN!M9,IF(cal!$S$7=3,DE!M9,IF(cal!$S$7=4,FR!M9,IF(cal!$S$7=5,NR!M9,IF(cal!$S$7=6,SP!M9,))))))","v":"Eenheidsstelsel"},{"$f":"IF($S$7=1,NL!N9,IF(cal!$S$7=2,EN!N9,IF(cal!$S$7=3,DE!N9,IF(cal!$S$7=4,FR!N9,IF(cal!$S$7=5,#REF!,)))))","v":0},{"$nulls":4},{"$f":"IF($W$4=1,E9,IF($W$4=2,(E9-32)/1.8))","v":{"v":75,"d":"75.0"}},{"$nulls":3},{"$f":"IF($W$4=1,K9,IF($W$4=2,(K9-32)/1.8))","v":{"v":8,"d":"8.0"}},"Briza 12 H55 4P casing"]
[null,{"$f":"IF($S$7=1,NL!B10,IF(cal!$S$7=2,EN!B10,IF(cal!$S$7=3,DE!B10,IF(cal!$S$7=4,FR!B10,IF(cal!$S$7=5,NR!B10,IF(cal!$S$7=6,SP!B10,IF(cal!$S$7=7,SW!B10,IF(cal!$S$7=8,TS!B10,IF(cal!$S$7=9,ExtraTaal1!B10,IF(cal!$S$7=10,ExtraTaal2!B10,IF(cal!$S$7=11,ExtraTaal3!B10,)))))))))))","v":"Water retour"},{"$f":"IF($S$7=1,NL!C10,IF(cal!$S$7=2,EN!C10,IF(cal!$S$7=3,DE!C10,IF(cal!$S$7=4,FR!C10,IF(cal!$S$7=5,NR!C10,IF(cal!$S$7=6,SP!C10,IF(cal!$S$7=7,SW!C10,IF(cal!$S$7=8,TS!C10,IF(cal!$S$7=9,ExtraTaal1!C10,IF(cal!$S$7=10,ExtraTaal2!C10,IF(cal!$S$7=11,ExtraTaal3!C10,)))))))))))","v":0},{"$f":"IF($S$7=1,NL!D10,IF(cal!$S$7=2,EN!D10,IF(cal!$S$7=3,DE!D10,IF(cal!$S$7=4,FR!D10,IF(cal!$S$7=5,NR!D10,IF(cal!$S$7=6,SP!D10,IF(cal!$S$7=7,SW!D10,IF(cal!$S$7=8,TS!D10,IF(cal!$S$7=9,ExtraTaal1!D10,IF(cal!$S$7=10,ExtraTaal2!D10,IF(cal!$S$7=11,ExtraTaal3!D10,)))))))))))","v":0},{"$f":"'Briza 12'!E9","v":65},{"$f":"F9","v":"°C"},{"$f":"B10","v":"Water retour"},{"$f":"IF($S$7=1,NL!H10,IF(cal!$S$7=2,EN!H10,IF(cal!$S$7=3,DE!H10,IF(cal!$S$7=4,FR!H10,))))","v":0},{"$f":"IF($S$7=1,NL!I10,IF(cal!$S$7=2,EN!I10,IF(cal!$S$7=3,DE!I10,IF(cal!$S$7=4,FR!I10,))))","v":0},{"$f":"IF($S$7=1,NL!J10,IF(cal!$S$7=2,EN!J10,IF(cal!$S$7=3,DE!J10,IF(cal!$S$7=4,FR!J10,))))","v":0},{"$f":"'Briza 12'!K9","v":14},{"$f":"F9","v":"°C"},{"$nulls":6},{"$f":"IF($W$4=1,E10,IF($W$4=2,(E10-32)/1.8))","v":{"v":65,"d":"65.0"}},{"$nulls":3},{"$f":"IF($W$4=1,K10,IF($W$4=2,(K10-32)/1.8))","v":{"v":14,"d":"14.0"}},null,"p_atm","h[mm]","cf_h"]
[null,{"$f":"IF($S$7=1,NL!B11,IF(cal!$S$7=2,EN!B11,IF(cal!$S$7=3,DE!B11,IF(cal!$S$7=4,FR!B11,IF(cal!$S$7=5,NR!B11,IF(cal!$S$7=6,SP!B11,IF(cal!$S$7=7,SW!B11,IF(cal!$S$7=8,TS!B11,IF(cal!$S$7=9,ExtraTaal1!B11,IF(cal!$S$7=10,ExtraTaal2!B11,IF(cal!$S$7=11,ExtraTaal3!B11,)))))))))))","v":"Ruimte"},{"$f":"IF($S$7=1,NL!C11,IF(cal!$S$7=2,EN!C11,IF(cal!$S$7=3,DE!C11,IF(cal!$S$7=4,FR!C11,IF(cal!$S$7=5,NR!C11,IF(cal!$S$7=6,SP!C11,IF(cal!$S$7=7,SW!C11,IF(cal!$S$7=8,TS!C11,IF(cal!$S$7=9,ExtraTaal1!C11,IF(cal!$S$7=10,ExtraTaal2!C11,IF(cal!$S$7=11,ExtraTaal3!C11,)))))))))))","v":0},{"$f":"IF($S$7=1,NL!D11,IF(cal!$S$7=2,EN!D11,IF(cal!$S$7=3,DE!D11,IF(cal!$S$7=4,FR!D11,IF(cal!$S$7=5,NR!D11,IF(cal!$S$7=6,SP!D11,IF(cal!$S$7=7,SW!D11,IF(cal!$S$7=8,TS!D11,IF(cal!$S$7=9,ExtraTaal1!D11,IF(cal!$S$7=10,ExtraTaal2!D11,IF(cal!$S$7=11,ExtraTaal3!D11,)))))))))))","v":0},{"$f":"'Briza 12'!E10","v":20},{"$f":"F9","v":"°C"},{"$f":"B11","v":"Ruimte"},{"$f":"IF($S$7=1,NL!H11,IF(cal!$S$7=2,EN!H11,IF(cal!$S$7=3,DE!H11,IF(cal!$S$7=4,FR!H11,))))","v":0},null,null,{"$f":"'Briza 12'!K10","v":25},{"$f":"F9","v":"°C"},{"$nulls":6},{"v":20,"d":"20.0"},{"$nulls":3},{"v":25,"d":"25.0"},null,{"$f":"IF($W$4=1,(101325*(1-((0.0065*M8)/(288.15)))^((9.81*0.028964)/(8.31447*0.0065))),IF($W$4=2,(101325*(1-((0.0065*(M8*0.3048))/(288.15)))^((9.81*0.028964)/(8.31447*0.0065)))))","v":101325},{"$f":"IF($W$4=1,M8/1000,IF($W$4=2,M8*0.0003048))","v":0},{"$f":"-(0.000265264729874266*Z11^6)+(0.000957582908802335*Z11^5)+(0.00470250661483425*Z11^4)-(0.0298716926548353*Z11^3)+(0.0557086806557086*Z11^2)-(0.0484008125693582*Z11)+1","v":1}]
[{"$nulls":6},{"$f":"IF($S$7=1,NL!G12,IF(cal!$S$7=2,EN!G12,IF(cal!$S$7=3,DE!G12,IF(cal!$S$7=4,FR!G12,IF(cal!$S$7=5,NR!G12,IF(cal!$S$7=6,SP!G12,IF(cal!$S$7=7,SW!G12,IF(cal!$S$7=8,TS!G12,IF(cal!$S$7=9,ExtraTaal1!G12,IF(cal!$S$7=10,ExtraTaal2!G12,IF(cal!$S$7=11,ExtraTaal3!G12,)))))))))))","v":"Relatieve vochtigheid"},{"$nulls":3},{"$f":"'Briza 12'!K11","v":{"v":0.5,"d":"50%"}}]
[]
[{"$nulls":3},{"$f":"IF($W$4=1,1,IF($W$4=2,3.412141633))","v":{"v":1,"d":"1.0000"}},{"$f":"IF($W$4=1,1,IF($W$4=2,0.004403))","v":{"v":1,"d":"1.0000"}},{"$f":"IF($W$4=1,1,IF($W$4=2,4.0147))","v":{"v":1,"d":"1.0000"}},{"$f":"IF($W$4=1,1,IF($W$4=2,3.412141633))","v":{"v":1,"d":"1.0000"}},{"v":1,"d":"1.0000"},{"$f":"IF($W$4=1,1,IF($W$4=2,0.004403))","v":{"v":1,"d":"1.0000"}},{"$f":"IF($W$4=1,1,IF($W$4=2,4.0147))","v":{"v":1,"d":"1.0000"}},{"$f":"IF($W$4=1,0.000334444444444444,IF($W$4=2,0.000568224721372))","v":0.000334444444444444},null,{"$f":"IF($W$4=1,1,IF($W$4=2,1.8))","v":1},{"$f":"IF($W$4=1,1,IF($W$4=2,0.588575))","v":{"v":1,"d":"1.0000"}},{"$f":"IF($W$4=1,0,IF($W$4=2,32))","v":{"v":0,"d":"0.0000"}}]
[null,{"$f":"IF($S$7=1,NL!B15,IF(cal!$S$7=2,EN!B15,IF(cal!$S$7=3,DE!B15,IF(cal!$S$7=4,FR!B15,IF(cal!$S$7=5,NR!B15,IF(cal!$S$7=6,SP!B15,IF(cal!$S$7=7,SW!B15,IF(cal!$S$7=8,TS!B15,IF(cal!$S$7=9,ExtraTaal1!B15,IF(cal!$S$7=10,ExtraTaal2!B15,IF(cal!$S$7=11,ExtraTaal3!B15,)))))))))))","v":"Snelheidsniveau"},{"$f":"IF($S$7=1,NL!C15,IF(cal!$S$7=2,EN!C15,IF(cal!$S$7=3,DE!C15,IF(cal!$S$7=4,FR!C15,IF(cal!$S$7=5,NR!C15,IF(cal!$S$7=6,SP!C15,IF(cal!$S$7=7,SW!C15,IF(cal!$S$7=8,TS!C15,IF(cal!$S$7=9,ExtraTaal1!C15,IF(cal!$S$7=10,ExtraTaal2!C15,IF(cal!$S$7=11,ExtraTaal3!C15,)))))))))))","v":"Stuurspanning [V]"},{"$f":"IF($S$7=1,NL!D15,IF(cal!$S$7=2,EN!D15,IF(cal!$S$7=3,DE!D15,IF(cal!$S$7=4,FR!D15,IF(cal!$S$7=5,NR!D15,IF(cal!$S$7=6,SP!D15,IF(cal!$S$7=7,SW!D15,IF(cal!$S$7=8,TS!D15,IF(cal!$S$7=9,ExtraTaal1!D15,IF(cal!$S$7=10,ExtraTaal2!D15,IF(cal!$S$7=11,ExtraTaal3!D15,)))))))))))","v":"Warmteafgifte  75/65/20 [W]"},{"$f":"IF($S$7=1,NL!E15,IF(cal!$S$7=2,EN!E15,IF(cal!$S$7=3,DE!E15,IF(cal!$S$7=4,FR!E15,IF(cal!$S$7=5,NR!E15,IF(cal!$S$7=6,SP!E15,IF(cal!$S$7=7,SW!E15,IF(cal!$S$7=8,TS!E15,IF(cal!$S$7=9,ExtraTaal1!E15,IF(cal!$S$7=10,ExtraTaal2!E15,IF(cal!$S$7=11,ExtraTaal3!E15,)))))))))))","v":"Waterdebiet, verwarming [l/h]"},{"$f":"IF($S$7=1,NL!F15,IF(cal!$S$7=2,EN!F15,IF(cal!$S$7=3,DE!F15,IF(cal!$S$7=4,FR!F15,IF(cal!$S$7=5,NR!F15,IF(cal!$S$7=6,SP!F15,IF(cal!$S$7=7,SW!F15,IF(cal!$S$7=8,TS!F15,IF(cal!$S$7=9,ExtraTaal1!F15,IF(cal!$S$7=10,ExtraTaal2!F15,IF(cal!$S$7=11,ExtraTaal3!F15,)))))))))))","v":"Waterzijdig drukverlies [kPa]"},{"$f":"IF($S$7=1,NL!G15,IF(cal!$S$7=2,EN!G15,IF(cal!$S$7=3,DE!G15,IF(cal!$S$7=4,FR!G15,IF(cal!$S$7=5,NR!G15,IF(cal!$S$7=6,SP!G15,IF(cal!$S$7=7,SW!G15,IF(cal!$S$7=8,TS!G15,IF(cal!$S$7=9,ExtraTaal1!G15,IF(cal!$S$7=10,ExtraTaal2!G15,IF(cal!$S$7=11,ExtraTaal3!G15,)))))))))))","v":"Voelb. Koelcapaciteit  8/14/25 [W]"},{"$f":"IF($S$7=1,NL!H15,IF(cal!$S$7=2,EN!H15,IF(cal!$S$7=3,DE!H15,IF(cal!$S$7=4,FR!H15,IF(cal!$S$7=5,NR!H15,IF(cal!$S$7=6,SP!H15,IF(cal!$S$7=7,SW!H15,IF(cal!$S$7=8,TS!H15,IF(cal!$S$7=9,ExtraTaal1!H15,IF(cal!$S$7=10,ExtraTaal2!H15,IF(cal!$S$7=11,ExtraTaal3!H15,)))))))))))","v":"Tot. koelcapaciteit 8/14/25 [W]"},{"$f":"IF($S$7=1,NL!I15,IF(cal!$S$7=2,EN!I15,IF(cal!$S$7=3,DE!I15,IF(cal!$S$7=4,FR!I15,IF(cal!$S$7=5,NR!I15,IF(cal!$S$7=6,SP!I15,IF(cal!$S$7=7,SW!I15,IF(cal!$S$7=8,TS!I15,IF(cal!$S$7=9,ExtraTaal1!I15,IF(cal!$S$7=10,ExtraTaal2!I15,IF(cal!$S$7=11,ExtraTaal3!I15,)))))))))))","v":"Waterdebiet, koeling [l/h]"},{"$f":"IF($S$7=1,NL!J15,IF(cal!$S$7=2,EN!J15,IF(cal!$S$7=3,DE!J15,IF(cal!$S$7=4,FR!J15,IF(cal!$S$7=5,NR!J15,IF(cal!$S$7=6,SP!J15,IF(cal!$S$7=7,SW!J15,IF(cal!$S$7=8,TS!J15,IF(cal!$S$7=9,ExtraTaal1!J15,IF(cal!$S$7=10,ExtraTaal2!J15,IF(cal!$S$7=11,ExtraTaal3!J15,)))))))))))","v":"Waterzijdig drukverlies [kPa]"},{"$f":"IF($S$7=1,NL!K15,IF(cal!$S$7=2,EN!K15,IF(cal!$S$7=3,DE!K15,IF(cal!$S$7=4,FR!K15,IF(cal!$S$7=5,NR!K15,IF(cal!$S$7=6,SP!K15,IF(cal!$S$7=7,SW!K15,IF(cal!$S$7=8,TS!K15,IF(cal!$S$7=9,ExtraTaal1!K15,IF(cal!$S$7=10,ExtraTaal2!K15,IF(cal!$S$7=11,ExtraTaal3!K15,)))))))))))","v":"Geluidsdruk ** [dB(A)]"},{"$f":"IF($S$7=1,NL!L15,IF(cal!$S$7=2,EN!L15,IF(cal!$S$7=3,DE!L15,IF(cal!$S$7=4,FR!L15,IF(cal!$S$7=5,NR!L15,IF(cal!$S$7=6,SP!L15,IF(cal!$S$7=7,SW!L15,IF(cal!$S$7=8,TS!L15,IF(cal!$S$7=9,ExtraTaal1!L15,IF(cal!$S$7=10,ExtraTaal2!L15,IF(cal!$S$7=11,ExtraTaal3!L15,)))))))))))","v":"Geluidsvermogen * [dB(A)]"},{"$f":"IF($S$7=1,NL!M15,IF(cal!$S$7=2,EN!M15,IF(cal!$S$7=3,DE!M15,IF(cal!$S$7=4,FR!M15,IF(cal!$S$7=5,NR!M15,IF(cal!$S$7=6,SP!M15,IF(cal!$S$7=7,SW!M15,IF(cal!$S$7=8,TS!M15,IF(cal!$S$7=9,ExtraTaal1!M15,IF(cal!$S$7=10,ExtraTaal2!M15,IF(cal!$S$7=11,ExtraTaal3!M15,)))))))))))","v":"Opgenomen elektr. vermogen [W]"},{"$f":"IF($S$7=1,NL!N15,IF(cal!$S$7=2,EN!N15,IF(cal!$S$7=3,DE!N15,IF(cal!$S$7=4,FR!N15,IF(cal!$S$7=5,NR!N15,IF(cal!$S$7=6,SP!N15,IF(cal!$S$7=7,SW!N15,IF(cal!$S$7=8,TS!N15,IF(cal!$S$7=9,ExtraTaal1!N15,IF(cal!$S$7=10,ExtraTaal2!N15,IF(cal!$S$7=11,ExtraTaal3!N15,)))))))))))","v":"Luchtdebiet [m³/h]"},{"$f":"IF($S$7=1,NL!O15,IF(cal!$S$7=2,EN!O15,IF(cal!$S$7=3,DE!O15,IF(cal!$S$7=4,FR!O15,IF(cal!$S$7=5,NR!O15,IF(cal!$S$7=6,SP!O15,IF(cal!$S$7=7,SW!O15,IF(cal!$S$7=8,TS!O15,IF(cal!$S$7=9,ExtraTaal1!O15,IF(cal!$S$7=10,ExtraTaal2!O15,IF(cal!$S$7=11,ExtraTaal3!O15,)))))))))))","v":"Uitblaastemp. verwarming  [°C]"},{"$f":"IF($S$7=1,NL!P15,IF(cal!$S$7=2,EN!P15,IF(cal!$S$7=3,DE!P15,IF(cal!$S$7=4,FR!P15,IF(cal!$S$7=5,NR!P15,IF(cal!$S$7=6,SP!P15,IF(cal!$S$7=7,SW!P15,IF(cal!$S$7=8,TS!P15,IF(cal!$S$7=9,ExtraTaal1!P15,IF(cal!$S$7=10,ExtraTaal2!P15,IF(cal!$S$7=11,ExtraTaal3!P15,)))))))))))","v":"Uitblaastemp. koeling  [°C]"},{"$nulls":6},"Q_verw","dP_verw","Q_voelb_c","dP_cool","Geluid_P","P_elek","V_air",null,"Q_verw","dP_verw","Q_voelb_c","dP_cool","Geluid_P","P_elek","V_air","Q_verw","dP_verw","Q_voelb_c","dP_cool","Geluid_P","P_elek","V_air","Q_verw","dP_verw","Q_voelb_c","dP_cool","Geluid_P","P_elek","V_air","Q_verw","dP_verw","Q_voelb_c","dP_cool","Geluid_P","P_elek","V_air","Q_verw","dP_verw","Q_voelb_c","dP_cool","Geluid_P","P_elek","V_air","Q_verw","dP_verw","Q_voelb_c","dP_cool","Geluid_P","P_elek","V_air","Q_verw","dP_verw","Q_voelb_c","dP_cool","Geluid_P","P_elek","V_air","Q_verw","dP_verw","Q_voelb_c","dP_cool","Geluid_P","P_elek","V_air"]
[null,{"$f":"IF($S$7=1,NL!B16,IF(cal!$S$7=2,EN!B16,IF(cal!$S$7=3,DE!B16,IF(cal!$S$7=4,FR!B16,IF(cal!$S$7=5,NR!B16,IF(cal!$S$7=6,SP!B16,IF(cal!$S$7=7,SW!B16,IF(cal!$S$7=8,TS!B16,IF(cal!$S$7=9,ExtraTaal1!B16,IF(cal!$S$7=10,ExtraTaal2!B16,IF(cal!$S$7=11,ExtraTaal3!B16,)))))))))))","v":"Briza 12 hoogte 41 cm breedte 14 cm lengte 75 cm (Type 1)"},{"$f":"IF($S$7=1,NL!C16,IF(cal!$S$7=2,EN!C16,IF(cal!$S$7=3,DE!C16,IF(cal!$S$7=4,FR!C16,IF(cal!$S$7=5,NR!C16,IF(cal!$S$7=6,SP!C16,))))))","v":0},{"$f":"IF($S$7=1,NL!D16,IF(cal!$S$7=2,EN!D16,IF(cal!$S$7=3,DE!D16,IF(cal!$S$7=4,FR!D16,IF(cal!$S$7=5,NR!D16,IF(cal!$S$7=6,SP!D16,))))))","v":0},{"$f":"IF($S$7=1,NL!E16,IF(cal!$S$7=2,EN!E16,IF(cal!$S$7=3,DE!E16,IF(cal!$S$7=4,FR!E16,IF(cal!$S$7=5,NR!E16,IF(cal!$S$7=6,SP!E16,))))))","v":0},{"$f":"IF($S$7=1,NL!F16,IF(cal!$S$7=2,EN!F16,IF(cal!$S$7=3,DE!F16,IF(cal!$S$7=4,FR!F16,IF(cal!$S$7=5,NR!F16,IF(cal!$S$7=6,SP!F16,))))))","v":0},{"$f":"IF($S$7=1,NL!G16,IF(cal!$S$7=2,EN!G16,IF(cal!$S$7=3,DE!G16,IF(cal!$S$7=4,FR!G16,IF(cal!$S$7=5,NR!G16,IF(cal!$S$7=6,SP!G16,))))))","v":0},{"$f":"IF($S$7=1,NL!H16,IF(cal!$S$7=2,EN!H16,IF(cal!$S$7=3,DE!H16,IF(cal!$S$7=4,FR!H16,IF(cal!$S$7=5,NR!H16,IF(cal!$S$7=6,SP!H16,))))))","v":0},{"$f":"IF($S$7=1,NL!I16,IF(cal!$S$7=2,EN!I16,IF(cal!$S$7=3,DE!I16,IF(cal!$S$7=4,FR!I16,IF(cal!$S$7=5,NR!I16,IF(cal!$S$7=6,SP!I16,))))))","v":0},{"$f":"IF($S$7=1,NL!J16,IF(cal!$S$7=2,EN!J16,IF(cal!$S$7=3,DE!J16,IF(cal!$S$7=4,FR!J16,IF(cal!$S$7=5,NR!J16,IF(cal!$S$7=6,SP!J16,))))))","v":0},{"$f":"IF($S$7=1,NL!K16,IF(cal!$S$7=2,EN!K16,IF(cal!$S$7=3,DE!K16,IF(cal!$S$7=4,FR!K16,IF(cal!$S$7=5,NR!K16,IF(cal!$S$7=6,SP!K16,))))))","v":0},{"$f":"IF($S$7=1,NL!L16,IF(cal!$S$7=2,EN!L16,IF(cal!$S$7=3,DE!L16,IF(cal!$S$7=4,FR!L16,IF(cal!$S$7=5,NR!L16,IF(cal!$S$7=6,SP!L16,))))))","v":0},{"$f":"IF($S$7=1,NL!M16,IF(cal!$S$7=2,EN!M16,IF(cal!$S$7=3,DE!M16,IF(cal!$S$7=4,FR!M16,IF(cal!$S$7=5,NR!M16,IF(cal!$S$7=6,SP!M16,))))))","v":0},{"$f":"IF($S$7=1,NL!N16,IF(cal!$S$7=2,EN!N16,IF(cal!$S$7=3,DE!N16,IF(cal!$S$7=4,FR!N16,IF(cal!$S$7=5,NR!N16,IF(cal!$S$7=6,SP!N16,))))))","v":0},{"$f":"IF($S$7=1,NL!O16,IF(cal!$S$7=2,EN!O16,IF(cal!$S$7=3,DE!O16,IF(cal!$S$7=4,FR!O16,IF(cal!$S$7=5,NR!O16,IF(cal!$S$7=6,SP!O16,))))))","v":0},{"$f":"IF($S$7=1,NL!P16,IF(cal!$S$7=2,EN!P16,IF(cal!$S$7=3,DE!P16,IF(cal!$S$7=4,FR!P16,IF(cal!$S$7=5,NR!P16,IF(cal!$S$7=6,SP!P16,))))))","v":0},null,null,"n-value",{"$nulls":3},{"$f":"IF('Briza 12'!$K$4=cal!$X2,1,IF('Briza 12'!$K$4=cal!$X3,2,IF('Briza 12'!$K$4=cal!$X4,3,IF('Briza 12'!$K$4=cal!$X5,4,IF('Briza 12'!$K$4=cal!$X6,5,IF('Briza 12'!$K$4=cal!$X7,6,IF('Briza 12'!$K$4=cal!$X8,7,IF('Briza 12'!$K$4=cal!$X9,8,))))))))","v":3},{"$nulls":7},"Briza 12 H38 2P built-in",{"$nulls":6},"Briza 12 H38 4P built-in",{"$nulls":6},"Briza 12 H41 2P casing",{"$nulls":6},"Briza 12 H41 4P casing",{"$nulls":6},"Briza 12 H52 2P built-in",{"$nulls":6},"Briza 12 H52 4P built-in",{"$nulls":6},"Briza 12 H55 2P casing",{"$nulls":6},"Briza 12 H55 4P casing"]
[null,{"v":0.2,"d":"20%"},2,{"$f":"(($W$17*$C17^4+$W$18*$C17^3+$W$19*$C17^2+$W$20*$C17+$W$21)*((((Tv_heat-Tr_heat)/LN((Tv_heat-Tl_heat)/(Tr_heat-Tl_heat)))/((75-65)/LN((75-20)/(65-20))))^$S17))*$D$14*$AA$11","v":{"v":902.6320146734022,"d":"903"}},{"$f":"ROUND(((D17/$D$14)/((Tv_heat-Tr_heat)*1.163))*$E$14,IF($W$4=1,0,IF($W$4=2,2)))","v":78},{"$f":"($X$18*(E17/$E$14)^$X$20)*$F$14","v":{"v":0.18531046187992548,"d":"0.19"}},{"$f":"(($Y$17*$C17^4+$Y$18*$C17^3+$Y$19*$C17^2+$Y$20*$C17+$Y$21)*((((Tv_cool-Tr_cool)/LN((Tv_cool-Tl_cool)/(Tr_cool-Tl_cool)))/((16-18)/LN((16-27)/(18-27))))^S17))*$G$14*$AA$11","v":{"v":159.54351779103268,"d":"160"}},{"$f":"((G17/$G$14)/(IF((237.3*LN((RH*EXP(17.27*(Tl_cool/(Tl_cool+237.3))))))/(17.27-LN((RH*EXP(17.27*(Tl_cool/(Tl_cool+237.3))))))<((Tv_cool+Tr_cool)/2),1,IF(1/(1+((2258*((0.622/((p_atm/(1*611*EXP(17.27*(((Tv_cool+Tr_cool)/2)/(((Tv_cool+Tr_cool)/2)+237.3))))))-1)*1000-(0.622/((p_atm/(RH*611*EXP(17.27*(Tl_cool/(Tl_cool+237.3))))))-1)*1000))/(1005*(((Tv_cool+Tr_cool)/2)-Tl_cool))))*1.039+((-0.000729*$C17+0.001448)*(Tl_cool-((Tv_cool+Tr_cool)/2))+(0.016908*$C17-0.033574))*1.039>1,1,1/(1+((2258*((0.622/((p_atm/(1*611*EXP(17.27*(((Tv_cool+Tr_cool)/2)/(((Tv_cool+Tr_cool)/2)+237.3))))))-1)*1000-(0.622/((p_atm/(RH*611*EXP(17.27*(Tl_cool/(Tl_cool+237.3))))))-1)*1000))/(1005*(((Tv_cool+Tr_cool)/2)-Tl_cool))))*1.039+((-0.000729*$C17+0.001448)*(Tl_cool-((Tv_cool+Tr_cool)/2))+(0.016908*$C17-0.033574))*1.039))))*$H$14","v":{"v":194.56512269372098,"d":"195"}},{"$f":"ROUND(((H17/$H$14)/((Tr_cool-Tv_cool)*1.163))*$I$14,IF($W$4=1,0,IF($W$4=2,2)))","v":28},{"$f":"($Z$18*(I17/$I$14)^$Z$20)*$J$14","v":{"v":0.02825334052634823,"d":"0.03"}},{"$f":"L17-8","v":18.5},{"$f":"AA17","v":26.5},{"$f":"AB17","v":1.6},{"$f":"AC17*$N$14","v":64},{"$f":"(Tl_heat+(($D17/$G$14)/(1006*$N17*$K$14)))*(0.05*$C17+0.7)*$M$14+$O$14","v":{"v":49.535036178529445,"d":"49.5"}},{"$f":"(Tl_cool-(($G17/$G$14)/(1006*$N17*$K$14)))*$M$14+$O$14","v":{"v":17.59069926310443,"d":"17.6"}},null,null,{"v":1,"d":"1.000"},{"$nulls":3},{"$f":"IF($W$16=1,AE17,IF($W$16=2,AL17,IF($W$16=3,AS17,IF($W$16=4,AZ17,IF($W$16=5,BG17,IF($W$16=6,BN17,IF($W$16=7,BU17,IF($W$16=8,CB17))))))))","v":0.007426362651946308},{"$f":"IF($W$16=1,AF17,IF($W$16=2,AM17,IF($W$16=3,AT17,IF($W$16=4,BA17,IF($W$16=5,BH17,IF($W$16=6,BO17,IF($W$16=7,BV17,IF($W$16=8,CC17))))))))","v":"a"},{"$f":"IF($W$16=1,AG17,IF($W$16=2,AN17,IF($W$16=3,AU17,IF($W$16=4,BB17,IF($W$16=5,BI17,IF($W$16=6,BP17,IF($W$16=7,BW17,IF($W$16=8,CD17))))))))","v":0},{"$f":"IF($W$16=1,AH17,IF($W$16=2,AO17,IF($W$16=3,AV17,IF($W$16=4,BC17,IF($W$16=5,BJ17,IF($W$16=6,BQ17,IF($W$16=7,BX17,IF($W$16=8,CE17))))))))","v":"a"},{"$f":"IF($W$16=1,AI17,IF($W$16=2,AP17,IF($W$16=3,AW17,IF($W$16=4,BD17,IF($W$16=5,BK17,IF($W$16=6,BR17,IF($W$16=7,BY17,IF($W$16=8,CF17))))))))","v":26.5},{"$f":"IF($W$16=1,AJ17,IF($W$16=2,AQ17,IF($W$16=3,AX17,IF($W$16=4,BE17,IF($W$16=5,BL17,IF($W$16=6,BS17,IF($W$16=7,BZ17,IF($W$16=8,CG17))))))))","v":1.6},{"$f":"IF($W$16=1,AK17,IF($W$16=2,AR17,IF($W$16=3,AY17,IF($W$16=4,BF17,IF($W$16=5,BM17,IF($W$16=6,BT17,IF($W$16=7,CA17,IF($W$16=8,CH17))))))))","v":64},"c",-0.05696712200992136,"a",null,"a",{"v":27,"d":"27.0"},1.6,70,null,"a",null,"a",{"$f":"AI17","v":{"v":27,"d":"27.0"}},1.8,32,0.007426362651946308,"a",null,"a",26.5,{"$f":"AJ17","v":1.6},64,-0.30147360997762745,"a",null,"a",{"$f":"AW17","v":26.5},{"$f":"AQ17","v":1.8},29,0.6980955656450734,"a",-0.05708272495290441,"a",{"v":29,"d":"29.0"},{"v":2,"d":"2.0"},89,null,"a",0.046731123246244316,"a",{"$f":"BK17","v":{"v":29,"d":"29.0"}},1.6,30,null,"a",-1.0144326001132824E-3,"a",27.2,{"$f":"BL17","v":{"v":2,"d":"2.0"}},81,-0.24292209682737784,"a",null,"a",{"$f":"BY17","v":27.2},{"$f":"BS17","v":1.6},27]
[null,{"v":0.4,"d":"40%"},4,{"$f":"(($W$17*$C18^4+$W$18*$C18^3+$W$19*$C18^2+$W$20*$C18+$W$21)*((((Tv_heat-Tr_heat)/LN((Tv_heat-Tl_heat)/(Tr_heat-Tl_heat)))/((75-65)/LN((75-20)/(65-20))))^1))*$D$14*$AA$11","v":{"v":1034.5570615128618,"d":"1035"}},{"$f":"ROUND(((D18/$D$14)/((Tv_heat-Tr_heat)*1.163))*$E$14,IF($W$4=1,0,IF($W$4=2,2)))","v":89},{"$f":"($X$18*(E18/$E$14)^$X$20)*$F$14","v":{"v":0.2360939438701031,"d":"0.24"}},{"$f":"(($Y$17*$C18^4+$Y$18*$C18^3+$Y$19*$C18^2+$Y$20*$C18+$Y$21)*((((Tv_cool-Tr_cool)/LN((Tv_cool-Tl_cool)/(Tr_cool-Tl_cool)))/((16-18)/LN((16-27)/(18-27))))^S18))*$G$14*$AA$11","v":{"v":186.22089368908536,"d":"186"}},{"$f":"((G18/$G$14)/(IF((237.3*LN((RH*EXP(17.27*(Tl_cool/(Tl_cool+237.3))))))/(17.27-LN((RH*EXP(17.27*(Tl_cool/(Tl_cool+237.3))))))<((Tv_cool+Tr_cool)/2),1,IF(1/(1+((2258*((0.622/((p_atm/(1*611*EXP(17.27*(((Tv_cool+Tr_cool)/2)/(((Tv_cool+Tr_cool)/2)+237.3))))))-1)*1000-(0.622/((p_atm/(RH*611*EXP(17.27*(Tl_cool/(Tl_cool+237.3))))))-1)*1000))/(1005*(((Tv_cool+Tr_cool)/2)-Tl_cool))))*1.039+((-0.000729*$C18+0.001448)*(Tl_cool-((Tv_cool+Tr_cool)/2))+(0.016908*$C18-0.033574))*1.039>1,1,1/(1+((2258*((0.622/((p_atm/(1*611*EXP(17.27*(((Tv_cool+Tr_cool)/2)/(((Tv_cool+Tr_cool)/2)+237.3))))))-1)*1000-(0.622/((p_atm/(RH*611*EXP(17.27*(Tl_cool/(Tl_cool+237.3))))))-1)*1000))/(1005*(((Tv_cool+Tr_cool)/2)-Tl_cool))))*1.039+((-0.000729*$C18+0.001448)*(Tl_cool-((Tv_cool+Tr_cool)/2))+(0.016908*$C18-0.033574))*1.039))))*$H$14","v":{"v":223.30589330196105,"d":"223"}},{"$f":"ROUND(((H18/$H$14)/((Tr_cool-Tv_cool)*1.163))*$I$14,IF($W$4=1,0,IF($W$4=2,2)))","v":32},{"$f":"($Z$18*(I18/$I$14)^$Z$20)*$J$14","v":{"v":0.036102181928819276,"d":"0.04"}},{"$f":"L18-8","v":29.4},{"$f":"AA18","v":37.4},{"$f":"AB18","v":2.6},{"$f":"AC18*$N$14","v":101},{"$f":"(Tl_heat+(($D18/$G$14)/(1006*$N18*$K$14)))*(0.05*$C18+0.7)*$M$14+$O$14","v":{"v":45.40019276549573,"d":"45.4"}},{"$f":"(Tl_cool-(($G18/$G$14)/(1006*$N18*$K$14)))*$M$14+$O$14","v":{"v":19.519943124707005,"d":"19.5"}},null,null,{"v":1,"d":"1.000"},{"$nulls":3},{"$f":"IF($W$16=1,AE18,IF($W$16=2,AL18,IF($W$16=3,AS18,IF($W$16=4,AZ18,IF($W$16=5,BG18,IF($W$16=6,BN18,IF($W$16=7,BU18,IF($W$16=8,CB18))))))))","v":0.2117387680171521},6.2276819636539519E-5,-0.030099755140858282,6.2276819636539519E-5,37.4,2.6,101,"d",2.158567173060117,6.2276819636539519E-5,null,{"$f":"AF18","v":6.2276819636539519E-5},33.2,2.6,111,0.5102383173034456,{"$f":"AF18","v":6.2276819636539519E-5},null,{"$f":"AH18","v":6.2276819636539519E-5},{"$f":"AI18","v":33.2},{"v":3,"d":"3.0"},67,0.2117387680171521,{"$f":"AF18","v":6.2276819636539519E-5},-0.030099755140858282,{"$f":"AO18","v":6.2276819636539519E-5},37.4,{"$f":"AJ18","v":2.6},101,8.050935653010697,{"$f":"AF18","v":6.2276819636539519E-5},null,{"$f":"AH18","v":6.2276819636539519E-5},{"$f":"AW18","v":37.4},{"$f":"AQ18","v":{"v":3,"d":"3.0"}},61,-17.609691863971744,1.3263547865279744E-4,1.0825592582312564,{"$f":"BH18","v":1.3263547865279744E-4},{"v":35,"d":"35.0"},3.2,130,0.3018078853854786,{"$f":"AF18","v":6.2276819636539519E-5},-1.1964457007881224,{"$f":"BJ18","v":1.3263547865279744E-4},{"$f":"BK18","v":{"v":35,"d":"35.0"}},2.2,74,null,{"$f":"BH18","v":1.3263547865279744E-4},-2.0070321215289355E-3,{"$f":"BJ18","v":1.3263547865279744E-4},33.2,{"$f":"BL18","v":3.2},118,6.228804439978892,{"$f":"BO18","v":6.2276819636539519E-5},-0.10047556370896396,{"$f":"BQ18","v":1.3263547865279744E-4},{"$f":"BY18","v":33.2},{"$f":"BS18","v":2.2},67]
[null,{"v":0.6,"d":"60%"},6,{"$f":"(($W$17*$C19^4+$W$18*$C19^3+$W$19*$C19^2+$W$20*$C19+$W$21)*((((Tv_heat-Tr_heat)/LN((Tv_heat-Tl_heat)/(Tr_heat-Tl_heat)))/((75-65)/LN((75-20)/(65-20))))^1))*$D$14*$AA$11","v":{"v":1194.3093068594899,"d":"1194"}},{"$f":"ROUND(((D19/$D$14)/((Tv_heat-Tr_heat)*1.163))*$E$14,IF($W$4=1,0,IF($W$4=2,2)))","v":103},{"v":0.3087190798567941,"d":"0.31"},{"$f":"(($Y$17*$C19^4+$Y$18*$C19^3+$Y$19*$C19^2+$Y$20*$C19+$Y$21)*((((Tv_cool-Tr_cool)/LN((Tv_cool-Tl_cool)/(Tr_cool-Tl_cool)))/((16-18)/LN((16-27)/(18-27))))^S19))*$G$14*$AA$11","v":{"v":219.1973665744931,"d":"219"}},{"$f":"((G19/$G$14)/(IF((237.3*LN((RH*EXP(17.27*(Tl_cool/(Tl_cool+237.3))))))/(17.27-LN((RH*EXP(17.27*(Tl_cool/(Tl_cool+237.3))))))<((Tv_cool+Tr_cool)/2),1,IF(1/(1+((2258*((0.622/((p_atm/(1*611*EXP(17.27*(((Tv_cool+Tr_cool)/2)/(((Tv_cool+Tr_cool)/2)+237.3))))))-1)*1000-(0.622/((p_atm/(RH*611*EXP(17.27*(Tl_cool/(Tl_cool+237.3))))))-1)*1000))/(1005*(((Tv_cool+Tr_cool)/2)-Tl_cool))))*1.039+((-0.000729*$C19+0.001448)*(Tl_cool-((Tv_cool+Tr_cool)/2))+(0.016908*$C19-0.033574))*1.039>1,1,1/(1+((2258*((0.622/((p_atm/(1*611*EXP(17.27*(((Tv_cool+Tr_cool)/2)/(((Tv_cool+Tr_cool)/2)+237.3))))))-1)*1000-(0.622/((p_atm/(RH*611*EXP(17.27*(Tl_cool/(Tl_cool+237.3))))))-1)*1000))/(1005*(((Tv_cool+Tr_cool)/2)-Tl_cool))))*1.039+((-0.000729*$C19+0.001448)*(Tl_cool-((Tv_cool+Tr_cool)/2))+(0.016908*$C19-0.033574))*1.039))))*$H$14","v":{"v":258.53193713791353,"d":"259"}},{"$f":"ROUND(((H19/$H$14)/((Tr_cool-Tv_cool)*1.163))*$I$14,IF($W$4=1,0,IF($W$4=2,2)))","v":37},{"v":0.04712876427813621,"d":"0.05"},{"v":31.299999999999997,"d":"31.3"},39.3,4.3,141,{"$f":"(Tl_heat+(($D19/$G$14)/(1006*$N19*$K$14)))*(0.05*$C19+0.7)*$M$14+$O$14","v":{"v":45.17536275651017,"d":"45.2"}},{"$f":"(Tl_cool-(($G19/$G$14)/(1006*$N19*$K$14)))*$M$14+$O$14","v":{"v":20.379443844998995,"d":"20.4"}},null,null,{"v":1,"d":"1.000"},{"$nulls":3},0.194898331995627,"b",0.9305607865244807,"b",39.3,4.3,141,"e",-18.897288796430164,"b",0.10373635238004372,"b",40.5,4.3,155,-4.113114628907961,"b",0.2246738635684899,"b",40.5,4.8,95,0.194898331995627,"b",0.9305607865244807,"b",39.3,4.3,141,-70.67484160702348,"b",0.21600510650865656,"b",39.3,4.8,86,154.95813256389033,"b",-6.145257571269577,"b",41.9,5.5,169,-1.1470727585609135,"b",10.648506478498899,"b",41.9,3.6,118,-0.3566357515748594,"b",-0.0721164737460312,"b",40.2,5.5,154,-50.901906972048394,"b",1.8516402222660224,"b",40.2,3.6,107]
[null,{"v":0.8,"d":"80%"},8,{"$f":"(($W$17*$C20^4+$W$18*$C20^3+$W$19*$C20^2+$W$20*$C20+$W$21)*((((Tv_heat-Tr_heat)/LN((Tv_heat-Tl_heat)/(Tr_heat-Tl_heat)))/((75-65)/LN((75-20)/(65-20))))^1))*$D$14*$AA$11","v":{"v":1399.1815197239785,"d":"1399"}},{"$f":"ROUND(((D20/$D$14)/((Tv_heat-Tr_heat)*1.163))*$E$14,IF($W$4=1,0,IF($W$4=2,2)))","v":120},{"v":0.4086581345410091,"d":"0.41"},{"$f":"(($Y$17*$C20^4+$Y$18*$C20^3+$Y$19*$C20^2+$Y$20*$C20+$Y$21)*((((Tv_cool-Tr_cool)/LN((Tv_cool-Tl_cool)/(Tr_cool-Tl_cool)))/((16-18)/LN((16-27)/(18-27))))^S20))*$G$14*$AA$11","v":{"v":256.4749031831965,"d":"256"}},{"$f":"((G20/$G$14)/(IF((237.3*LN((RH*EXP(17.27*(Tl_cool/(Tl_cool+237.3))))))/(17.27-LN((RH*EXP(17.27*(Tl_cool/(Tl_cool+237.3))))))<((Tv_cool+Tr_cool)/2),1,IF(1/(1+((2258*((0.622/((p_atm/(1*611*EXP(17.27*(((Tv_cool+Tr_cool)/2)/(((Tv_cool+Tr_cool)/2)+237.3))))))-1)*1000-(0.622/((p_atm/(RH*611*EXP(17.27*(Tl_cool/(Tl_cool+237.3))))))-1)*1000))/(1005*(((Tv_cool+Tr_cool)/2)-Tl_cool))))*1.039+((-0.000729*$C20+0.001448)*(Tl_cool-((Tv_cool+Tr_cool)/2))+(0.016908*$C20-0.033574))*1.039>1,1,1/(1+((2258*((0.622/((p_atm/(1*611*EXP(17.27*(((Tv_cool+Tr_cool)/2)/(((Tv_cool+Tr_cool)/2)+237.3))))))-1)*1000-(0.622/((p_atm/(RH*611*EXP(17.27*(Tl_cool/(Tl_cool+237.3))))))-1)*1000))/(1005*(((Tv_cool+Tr_cool)/2)-Tl_cool))))*1.039+((-0.000729*$C20+0.001448)*(Tl_cool-((Tv_cool+Tr_cool)/2))+(0.016908*$C20-0.033574))*1.039))))*$H$14","v":{"v":297.6103462364294,"d":"298"}},{"$f":"ROUND(((H20/$H$14)/((Tr_cool-Tv_cool)*1.163))*$I$14,IF($W$4=1,0,IF($W$4=2,2)))","v":43},{"v":0.06210191655139985,"d":"0.06"},37.3,45.3,7.2,178,{"$f":"(Tl_heat+(($D20/$G$14)/(1006*$N20*$K$14)))*(0.05*$C20+0.7)*$M$14+$O$14","v":{"v":47.69950606055594,"d":"47.7"}},{"$f":"(Tl_cool-(($G20/$G$14)/(1006*$N20*$K$14)))*$M$14+$O$14","v":{"v":20.717445432580575,"d":"20.7"}},null,null,{"v":1,"d":"1.000"},{"$nulls":3},57.97328440504217,1.8358350093844202,4.904703066929431,1.8358350093844202,45.3,7.2,178,"f",134.69984250871585,1.8358350093844202,14.045470041924725,{"$f":"AF20","v":1.8358350093844202},{"v":47,"d":"47.0"},7.2,196,69.7125925473234,{"$f":"AF20","v":1.8358350093844202},8.287772013995193,{"$f":"AH20","v":1.8358350093844202},{"v":47,"d":"47.0"},{"v":8,"d":"8.0"},128,57.97328440504217,{"$f":"AF20","v":1.8358350093844202},4.904703066929431,{"$f":"AO20","v":1.8358350093844202},45.3,7.2,178,305.78049129814406,{"$f":"AF20","v":1.8358350093844202},7.20633401395817,{"$f":"AH20","v":1.8358350093844202},45.3,{"v":8,"d":"8.0"},116,-394.97241741556,1.8136893271096062,31.0068088055675,{"$f":"BH20","v":1.8136893271096062},47.7,9.6,212,40.965304033730064,{"$f":"AF20","v":1.8358350093844202},-22.92309547499193,{"$f":"BJ20","v":1.8136893271096062},47.7,6.3,151,152.87981581044934,{"$f":"BH20","v":1.8136893271096062},22.687985802451447,{"$f":"BJ20","v":1.8136893271096062},46.1,9.6,193,203.12988403023203,{"$f":"BO20","v":1.8358350093844202},4.151420157600327,{"$f":"BQ20","v":1.8136893271096062},46.1,6.3,137]
[null,{"v":1,"d":"100%"},10,{"$f":"(($W$17*$C21^4+$W$18*$C21^3+$W$19*$C21^2+$W$20*$C21+$W$21)*((((Tv_heat-Tr_heat)/LN((Tv_heat-Tl_heat)/(Tr_heat-Tl_heat)))/((75-65)/LN((75-20)/(65-20))))^1))*$D$14*$AA$11","v":{"v":1669.3181923753664,"d":"1669"}},{"$f":"ROUND(((D21/$D$14)/((Tv_heat-Tr_heat)*1.163))*$E$14,IF($W$4=1,0,IF($W$4=2,2)))","v":144},{"v":0.5711153747379181,"d":"0.57"},{"$f":"(($Y$17*$C21^4+$Y$18*$C21^3+$Y$19*$C21^2+$Y$20*$C21+$Y$21)*((((Tv_cool-Tr_cool)/LN((Tv_cool-Tl_cool)/(Tr_cool-Tl_cool)))/((16-18)/LN((16-27)/(18-27))))^S21))*$G$14*$AA$11","v":{"v":296.0554702511363,"d":"296"}},{"$f":"((G21/$G$14)/(IF((237.3*LN((RH*EXP(17.27*(Tl_cool/(Tl_cool+237.3))))))/(17.27-LN((RH*EXP(17.27*(Tl_cool/(Tl_cool+237.3))))))<((Tv_cool+Tr_cool)/2),1,IF(1/(1+((2258*((0.622/((p_atm/(1*611*EXP(17.27*(((Tv_cool+Tr_cool)/2)/(((Tv_cool+Tr_cool)/2)+237.3))))))-1)*1000-(0.622/((p_atm/(RH*611*EXP(17.27*(Tl_cool/(Tl_cool+237.3))))))-1)*1000))/(1005*(((Tv_cool+Tr_cool)/2)-Tl_cool))))*1.039+((-0.000729*$C21+0.001448)*(Tl_cool-((Tv_cool+Tr_cool)/2))+(0.016908*$C21-0.033574))*1.039>1,1,1/(1+((2258*((0.622/((p_atm/(1*611*EXP(17.27*(((Tv_cool+Tr_cool)/2)/(((Tv_cool+Tr_cool)/2)+237.3))))))-1)*1000-(0.622/((p_atm/(RH*611*EXP(17.27*(Tl_cool/(Tl_cool+237.3))))))-1)*1000))/(1005*(((Tv_cool+Tr_cool)/2)-Tl_cool))))*1.039+((-0.000729*$C21+0.001448)*(Tl_cool-((Tv_cool+Tr_cool)/2))+(0.016908*$C21-0.033574))*1.039))))*$H$14","v":{"v":338.0757017152491,"d":"338"}},{"$f":"ROUND(((H21/$H$14)/((Tr_cool-Tv_cool)*1.163))*$I$14,IF($W$4=1,0,IF($W$4=2,2)))","v":48},{"v":0.07599901238765913,"d":"0.08"},42.5,50.5,{"v":13,"d":"13.0"},214,{"$f":"(Tl_heat+(($D21/$G$14)/(1006*$N21*$K$14)))*(0.05*$C21+0.7)*$M$14+$O$14","v":{"v":51.82176206840366,"d":"51.8"}},{"$f":"(Tl_cool-(($G21/$G$14)/(1006*$N21*$K$14)))*$M$14+$O$14","v":{"v":20.88814918070638,"d":"20.9"}},null,null,{"v":1,"d":"1.000"},{"$nulls":3},784.093120588767,0,102.07589640134984,0,50.5,13,214,"g",789.8652091572945,null,84.48530639812616,null,{"v":52,"d":"52.0"},{"v":13,"d":"13.0"},235,672.4156235113211,null,82.54900128477956,null,{"v":52,"d":"52.0"},13.7,157,784.093120588767,null,102.07589640134984,null,50.5,{"v":13,"d":"13.0"},214,309.52771297860744,null,77.12870516216368,null,50.5,13.7,143,1799.5703194869316,null,141.61893986654567,null,{"v":52,"d":"52.0"},16.8,250,560.4281733003006,null,155.2936679267455,null,{"v":52,"d":"52.0"},10.3,188,1095.212852006489,null,124.68763734693975,null,50.5,16.8,228,361.3522797245796,null,122.85501458041243,null,50.5,10.3,171]
[null,{"$f":"IF($S$7=1,NL!B22,IF(cal!$S$7=2,EN!B22,IF(cal!$S$7=3,DE!B22,IF(cal!$S$7=4,FR!B22,IF(cal!$S$7=5,NR!B22,IF(cal!$S$7=6,SP!B22,IF(cal!$S$7=7,SW!B22,IF(cal!$S$7=8,TS!B22,IF(cal!$S$7=9,ExtraTaal1!B22,IF(cal!$S$7=10,ExtraTaal2!B22,IF(cal!$S$7=11,ExtraTaal3!B22,)))))))))))","v":"Briza 12 hoogte 41 cm breedte 14 cm lengte 95 cm (Type 2)"},{"$f":"IF($S$7=1,NL!C22,IF(cal!$S$7=2,EN!C22,IF(cal!$S$7=3,DE!C22,IF(cal!$S$7=4,FR!C22,IF(cal!$S$7=5,NR!C22,IF(cal!$S$7=6,SP!C22,))))))","v":0},{"$f":"IF($S$7=1,NL!D22,IF(cal!$S$7=2,EN!D22,IF(cal!$S$7=3,DE!D22,IF(cal!$S$7=4,FR!D22,IF(cal!$S$7=5,NR!D22,IF(cal!$S$7=6,SP!D22,))))))","v":0},{"$f":"IF($S$7=1,NL!E22,IF(cal!$S$7=2,EN!E22,IF(cal!$S$7=3,DE!E22,IF(cal!$S$7=4,FR!E22,IF(cal!$S$7=5,NR!E22,IF(cal!$S$7=6,SP!E22,))))))","v":0},{"$f":"IF($S$7=1,NL!F22,IF(cal!$S$7=2,EN!F22,IF(cal!$S$7=3,DE!F22,IF(cal!$S$7=4,FR!F22,IF(cal!$S$7=5,NR!F22,IF(cal!$S$7=6,SP!F22,))))))","v":0},{"$f":"IF($S$7=1,NL!G22,IF(cal!$S$7=2,EN!G22,IF(cal!$S$7=3,DE!G22,IF(cal!$S$7=4,FR!G22,IF(cal!$S$7=5,NR!G22,IF(cal!$S$7=6,SP!G22,))))))","v":0},{"$f":"IF($S$7=1,NL!H22,IF(cal!$S$7=2,EN!H22,IF(cal!$S$7=3,DE!H22,IF(cal!$S$7=4,FR!H22,IF(cal!$S$7=5,NR!H22,IF(cal!$S$7=6,SP!H22,))))))","v":0},{"$f":"IF($S$7=1,NL!I22,IF(cal!$S$7=2,EN!I22,IF(cal!$S$7=3,DE!I22,IF(cal!$S$7=4,FR!I22,IF(cal!$S$7=5,NR!I22,IF(cal!$S$7=6,SP!I22,))))))","v":0},{"$f":"IF($S$7=1,NL!J22,IF(cal!$S$7=2,EN!J22,IF(cal!$S$7=3,DE!J22,IF(cal!$S$7=4,FR!J22,IF(cal!$S$7=5,NR!J22,IF(cal!$S$7=6,SP!J22,))))))","v":0},{"$f":"IF($S$7=1,NL!K22,IF(cal!$S$7=2,EN!K22,IF(cal!$S$7=3,DE!K22,IF(cal!$S$7=4,FR!K22,IF(cal!$S$7=5,NR!K22,IF(cal!$S$7=6,SP!K22,))))))","v":0},{"$f":"IF($S$7=1,NL!L22,IF(cal!$S$7=2,EN!L22,IF(cal!$S$7=3,DE!L22,IF(cal!$S$7=4,FR!L22,IF(cal!$S$7=5,NR!L22,IF(cal!$S$7=6,SP!L22,))))))","v":0},{"$f":"IF($S$7=1,NL!M22,IF(cal!$S$7=2,EN!M22,IF(cal!$S$7=3,DE!M22,IF(cal!$S$7=4,FR!M22,IF(cal!$S$7=5,NR!M22,IF(cal!$S$7=6,SP!M22,))))))","v":0},{"$f":"IF($S$7=1,NL!N22,IF(cal!$S$7=2,EN!N22,IF(cal!$S$7=3,DE!N22,IF(cal!$S$7=4,FR!N22,IF(cal!$S$7=5,NR!N22,IF(cal!$S$7=6,SP!N22,))))))","v":0},{"$f":"IF($S$7=1,NL!O22,IF(cal!$S$7=2,EN!O22,IF(cal!$S$7=3,DE!O22,IF(cal!$S$7=4,FR!O22,IF(cal!$S$7=5,NR!O22,IF(cal!$S$7=6,SP!O22,))))))","v":0},{"$f":"IF($S$7=1,NL!P22,IF(cal!$S$7=2,EN!P22,IF(cal!$S$7=3,DE!P22,IF(cal!$S$7=4,FR!P22,IF(cal!$S$7=5,NR!P22,IF(cal!$S$7=6,SP!P22,))))))","v":0},null,null,"n-value",{"$nulls":3},"H",{"v":41,"d":"41.0"},"B",{"v":14,"d":"14.0"},"L",{"v":75,"d":"75.0"},null,null,"H",{"$f":"38*IF($W$4=1,1,IF($W$4=2,1/2.54))","v":38},"B",{"$f":"12*IF($W$4=1,1,IF($W$4=2,1/2.54))","v":12},"L",{"$f":"52*IF($W$4=1,1,IF($W$4=2,1/2.54))","v":52},null,"H",{"$f":"38*IF($W$4=1,1,IF($W$4=2,1/2.54))","v":38},"B",{"$f":"12*IF($W$4=1,1,IF($W$4=2,1/2.54))","v":12},"L",{"$f":"52*IF($W$4=1,1,IF($W$4=2,1/2.54))","v":52},null,"H",{"$f":"41*IF($W$4=1,1,IF($W$4=2,1/2.54))","v":41},"B",{"$f":"14*IF($W$4=1,1,IF($W$4=2,1/2.54))","v":14},"L",{"$f":"75*IF($W$4=1,1,IF($W$4=2,1/2.54))","v":75},null,"H",{"$f":"41*IF($W$4=1,1,IF($W$4=2,1/2.54))","v":41},"B",{"$f":"14*IF($W$4=1,1,IF($W$4=2,1/2.54))","v":14},"L",{"$f":"75*IF($W$4=1,1,IF($W$4=2,1/2.54))","v":75},null,"H",{"$f":"52*IF($W$4=1,1,IF($W$4=2,1/2.54))","v":52},"B",{"$f":"12*IF($W$4=1,1,IF($W$4=2,1/2.54))","v":12},"L",{"$f":"52*IF($W$4=1,1,IF($W$4=2,1/2.54))","v":52},null,"H",{"$f":"52*IF($W$4=1,1,IF($W$4=2,1/2.54))","v":52},"B",{"$f":"12*IF($W$4=1,1,IF($W$4=2,1/2.54))","v":12},"L",{"$f":"52*IF($W$4=1,1,IF($W$4=2,1/2.54))","v":52},null,"H",{"$f":"55*IF($W$4=1,1,IF($W$4=2,1/2.54))","v":55},"B",{"$f":"14*IF($W$4=1,1,IF($W$4=2,1/2.54))","v":14},"L",{"$f":"75*IF($W$4=1,1,IF($W$4=2,1/2.54))","v":75},null,"H",{"$f":"55*IF($W$4=1,1,IF($W$4=2,1/2.54))","v":55},"B",{"$f":"14*IF($W$4=1,1,IF($W$4=2,1/2.54))","v":14},"L",{"$f":"75*IF($W$4=1,1,IF($W$4=2,1/2.54))","v":75}]
[null,{"v":0.2,"d":"20%"},2,{"$f":"(($W$23*$C23^4+$W$24*$C23^3+$W$25*$C23^2+$W$26*$C23+$W$27)*((((Tv_heat-Tr_heat)/LN((Tv_heat-Tl_heat)/(Tr_heat-Tl_heat)))/((75-65)/LN((75-20)/(65-20))))^1))*$D$14*$AA$11","v":{"v":1545.0574900003676,"d":"1545"}},{"$f":"ROUND(((D23/$D$14)/((Tv_heat-Tr_heat)*1.163))*$E$14,IF($W$4=1,0,IF($W$4=2,2)))","v":133},{"$f":"($X$24*(E23/$E$14)^$X$26)*$F$14","v":{"v":0.6373680078471634,"d":"0.64"}},{"$f":"(($Y$23*$C23^4+$Y$24*$C23^3+$Y$25*$C23^2+$Y$26*$C23+$Y$27)*((((Tv_cool-Tr_cool)/LN((Tv_cool-Tl_cool)/(Tr_cool-Tl_cool)))/((16-18)/LN((16-27)/(18-27))))^S23))*$G$14*$AA$11","v":{"v":264.48417906365233,"d":"264"}},{"$f":"((G23/$G$14)/(IF((237.3*LN((RH*EXP(17.27*(Tl_cool/(Tl_cool+237.3))))))/(17.27-LN((RH*EXP(17.27*(Tl_cool/(Tl_cool+237.3))))))<((Tv_cool+Tr_cool)/2),1,IF(1/(1+((2258*((0.622/((p_atm/(1*611*EXP(17.27*(((Tv_cool+Tr_cool)/2)/(((Tv_cool+Tr_cool)/2)+237.3))))))-1)*1000-(0.622/((p_atm/(RH*611*EXP(17.27*(Tl_cool/(Tl_cool+237.3))))))-1)*1000))/(1005*(((Tv_cool+Tr_cool)/2)-Tl_cool))))*1.039+((-0.000729*$C23+0.001448)*(Tl_cool-((Tv_cool+Tr_cool)/2))+(0.016908*$C23-0.033574))*1.039>1,1,1/(1+((2258*((0.622/((p_atm/(1*611*EXP(17.27*(((Tv_cool+Tr_cool)/2)/(((Tv_cool+Tr_cool)/2)+237.3))))))-1)*1000-(0.622/((p_atm/(RH*611*EXP(17.27*(Tl_cool/(Tl_cool+237.3))))))-1)*1000))/(1005*(((Tv_cool+Tr_cool)/2)-Tl_cool))))*1.039+((-0.000729*$C23+0.001448)*(Tl_cool-((Tv_cool+Tr_cool)/2))+(0.016908*$C23-0.033574))*1.039))))*$H$14","v":{"v":322.5414448831961,"d":"323"}},{"$f":"ROUND(((H23/$H$14)/((Tr_cool-Tv_cool)*1.163))*$I$14,IF($W$4=1,0,IF($W$4=2,2)))","v":46},{"$f":"($Z$24*(I23/$I$14)^$Z$26)*$J$14","v":{"v":0.09280957156128374,"d":"0.09"}},{"$f":"L23-8","v":{"v":24,"d":"24.0"}},{"$f":"AA23","v":{"v":32,"d":"32.0"}},{"$f":"AB23","v":2.5},{"$f":"AC23*$N$14","v":108},{"$f":"(Tl_heat+(($D23/$G$14)/(1006*$N23*$K$14)))*(0.05*$C23+0.7)*$M$14+$O$14","v":{"v":50.016443751673116,"d":"50.0"}},{"$f":"(Tl_cool-((G23/$G$14)/(1006*N23*$K$14)))*$M$14+$O$14","v":{"v":17.72129738007028,"d":"17.7"}},null,null,{"v":1,"d":"1.000"},{"$nulls":3},{"$f":"IF($W$16=1,AE23,IF($W$16=2,AL23,IF($W$16=3,AS23,IF($W$16=4,AZ23,IF($W$16=5,BG23,IF($W$16=6,BN23,IF($W$16=7,BU23,IF($W$16=8,CB23))))))))","v":-1.8027755792474383},{"$f":"IF($W$16=1,AF23,IF($W$16=2,AM23,IF($W$16=3,AT23,IF($W$16=4,BA23,IF($W$16=5,BH23,IF($W$16=6,BO23,IF($W$16=7,BV23,IF($W$16=8,CC23))))))))","v":"a"},{"$f":"IF($W$16=1,AG23,IF($W$16=2,AN23,IF($W$16=3,AU23,IF($W$16=4,BB23,IF($W$16=5,BI23,IF($W$16=6,BP23,IF($W$16=7,BW23,IF($W$16=8,CD23))))))))","v":0},{"$f":"IF($W$16=1,AH23,IF($W$16=2,AO23,IF($W$16=3,AV23,IF($W$16=4,BC23,IF($W$16=5,BJ23,IF($W$16=6,BQ23,IF($W$16=7,BX23,IF($W$16=8,CE23))))))))","v":"a"},{"$f":"IF($W$16=1,AI23,IF($W$16=2,AP23,IF($W$16=3,AW23,IF($W$16=4,BD23,IF($W$16=5,BK23,IF($W$16=6,BR23,IF($W$16=7,BY23,IF($W$16=8,CF23))))))))","v":32},{"$f":"IF($W$16=1,AJ23,IF($W$16=2,AQ23,IF($W$16=3,AX23,IF($W$16=4,BE23,IF($W$16=5,BL23,IF($W$16=6,BS23,IF($W$16=7,BZ23,IF($W$16=8,CG23))))))))","v":2.5},{"$f":"IF($W$16=1,AK23,IF($W$16=2,AR23,IF($W$16=3,AY23,IF($W$16=4,BF23,IF($W$16=5,BM23,IF($W$16=6,BT23,IF($W$16=7,CA23,IF($W$16=8,CH23))))))))","v":108},"c",-1.3966690275112728,"a",null,"a",29.5,2.5,119,null,"a",null,"a",{"$f":"AI23","v":29.5},{"v":2,"d":"2.0"},57,-1.8027755792474383,"a",null,"a",{"v":32,"d":"32.0"},{"$f":"AJ23","v":2.5},108,null,"a",null,"a",{"$f":"AW23","v":{"v":32,"d":"32.0"}},{"$f":"AQ23","v":{"v":2,"d":"2.0"}},52,0.4983070997609461,"a",null,"a",29.8,2.2,127,-0.17567229699042283,"a",null,"a",{"$f":"BK23","v":29.8},2.1,79,null,"a",null,"a",31,{"$f":"BL23","v":2.2},116,-0.18030344638520918,"a",null,"a",{"$f":"BY23","v":31},{"$f":"BS23","v":2.1},72]
[null,{"v":0.4,"d":"40%"},4,{"$f":"(($W$23*$C24^4+$W$24*$C24^3+$W$25*$C24^2+$W$26*$C24+$W$27)*((((Tv_heat-Tr_heat)/LN((Tv_heat-Tl_heat)/(Tr_heat-Tl_heat)))/((75-65)/LN((75-20)/(65-20))))^1))*$D$14*$AA$11","v":{"v":1699.4501618638099,"d":"1699"}},{"$f":"ROUND(((D24/$D$14)/((Tv_heat-Tr_heat)*1.163))*$E$14,IF($W$4=1,0,IF($W$4=2,2)))","v":146},{"$f":"($X$24*(E24/$E$14)^$X$26)*$F$14","v":{"v":0.7549049202104832,"d":"0.75"}},{"$f":"(($Y$23*$C24^4+$Y$24*$C24^3+$Y$25*$C24^2+$Y$26*$C24+$Y$27)*((((Tv_cool-Tr_cool)/LN((Tv_cool-Tl_cool)/(Tr_cool-Tl_cool)))/((16-18)/LN((16-27)/(18-27))))^S24))*$G$14*$AA$11","v":{"v":300.4609972000166,"d":"300"}},{"$f":"((G24/$G$14)/(IF((237.3*LN((RH*EXP(17.27*(Tl_cool/(Tl_cool+237.3))))))/(17.27-LN((RH*EXP(17.27*(Tl_cool/(Tl_cool+237.3))))))<((Tv_cool+Tr_cool)/2),1,IF(1/(1+((2258*((0.622/((p_atm/(1*611*EXP(17.27*(((Tv_cool+Tr_cool)/2)/(((Tv_cool+Tr_cool)/2)+237.3))))))-1)*1000-(0.622/((p_atm/(RH*611*EXP(17.27*(Tl_cool/(Tl_cool+237.3))))))-1)*1000))/(1005*(((Tv_cool+Tr_cool)/2)-Tl_cool))))*1.039+((-0.000729*$C24+0.001448)*(Tl_cool-((Tv_cool+Tr_cool)/2))+(0.016908*$C24-0.033574))*1.039>1,1,1/(1+((2258*((0.622/((p_atm/(1*611*EXP(17.27*(((Tv_cool+Tr_cool)/2)/(((Tv_cool+Tr_cool)/2)+237.3))))))-1)*1000-(0.622/((p_atm/(RH*611*EXP(17.27*(Tl_cool/(Tl_cool+237.3))))))-1)*1000))/(1005*(((Tv_cool+Tr_cool)/2)-Tl_cool))))*1.039+((-0.000729*$C24+0.001448)*(Tl_cool-((Tv_cool+Tr_cool)/2))+(0.016908*$C24-0.033574))*1.039))))*$H$14","v":{"v":360.2963666051842,"d":"360"}},{"$f":"ROUND(((H24/$H$14)/((Tr_cool-Tv_cool)*1.163))*$I$14,IF($W$4=1,0,IF($W$4=2,2)))","v":52},{"$f":"($Z$24*(I24/$I$14)^$Z$26)*$J$14","v":{"v":0.11593731452928037,"d":"0.12"}},{"v":30,"d":"30.0"},{"v":38,"d":"38.0"},4.3,172,{"$f":"(Tl_heat+(($D24/$G$14)/(1006*$N24*$K$14)))*(0.05*$C24+0.7)*$M$14+$O$14","v":{"v":44.43020481587197,"d":"44.4"}},{"$f":"(Tl_cool-((G24/$G$14)/(1006*N24*$K$14)))*$M$14+$O$14","v":{"v":19.807964054504478,"d":"19.8"}},null,null,{"v":1,"d":"1.000"},{"$nulls":3},44.485461171044086,8.9125876915269658E-5,0.01476638839062954,8.9125876915269658E-5,38,4.3,172,"d",38.1433499505084,8.9125876915269658E-5,null,{"$f":"AF24","v":8.9125876915269658E-5},35.5,4.3,189,1.4391019442875652,{"$f":"AF24","v":8.9125876915269658E-5},0.09056230583069405,{"$f":"AH24","v":8.9125876915269658E-5},35.5,3.4,101,44.485461171044086,{"$f":"AF24","v":8.9125876915269658E-5},0.01476638839062954,{"$f":"AO24","v":8.9125876915269658E-5},{"v":38,"d":"38.0"},4.3,172,0.9685779641783515,{"$f":"AF24","v":8.9125876915269658E-5},0.1360465769148562,{"$f":"AH24","v":8.9125876915269658E-5},{"v":38,"d":"38.0"},3.4,92,-13.263227732012894,1.6747942882275273E-4,-0.1558033627132356,{"$f":"BH24","v":1.6747942882275273E-4},35.2,3.6,193,5.310983637366931,{"$f":"AF24","v":8.9125876915269658E-5},-0.13585286893887913,{"$f":"BJ24","v":1.6747942882275273E-4},35.2,3.4,135,-0.36935046666650995,{"$f":"BH24","v":1.6747942882275273E-4},-0.14605906212444036,{"$f":"BJ24","v":1.6747942882275273E-4},35.8,3.6,176,5.194823262565557,{"$f":"BO24","v":8.9125876915269658E-5},-0.10565020591365754,{"$f":"BQ24","v":1.6747942882275273E-4},35.8,3.4,123]
[null,{"v":0.6,"d":"60%"},6,{"$f":"(($W$23*$C25^4+$W$24*$C25^3+$W$25*$C25^2+$W$26*$C25+$W$27)*((((Tv_heat-Tr_heat)/LN((Tv_heat-Tl_heat)/(Tr_heat-Tl_heat)))/((75-65)/LN((75-20)/(65-20))))^1))*$D$14*$AA$11","v":{"v":1797.2271053057073,"d":"1797"}},{"$f":"ROUND(((D25/$D$14)/((Tv_heat-Tr_heat)*1.163))*$E$14,IF($W$4=1,0,IF($W$4=2,2)))","v":155},{"v":0.8414705280809154,"d":"0.84"},{"$f":"(($Y$23*$C25^4+$Y$24*$C25^3+$Y$25*$C25^2+$Y$26*$C25+$Y$27)*((((Tv_cool-Tr_cool)/LN((Tv_cool-Tl_cool)/(Tr_cool-Tl_cool)))/((16-18)/LN((16-27)/(18-27))))^S25))*$G$14*$AA$11","v":{"v":348.93644722168705,"d":"349"}},{"$f":"((G25/$G$14)/(IF((237.3*LN((RH*EXP(17.27*(Tl_cool/(Tl_cool+237.3))))))/(17.27-LN((RH*EXP(17.27*(Tl_cool/(Tl_cool+237.3))))))<((Tv_cool+Tr_cool)/2),1,IF(1/(1+((2258*((0.622/((p_atm/(1*611*EXP(17.27*(((Tv_cool+Tr_cool)/2)/(((Tv_cool+Tr_cool)/2)+237.3))))))-1)*1000-(0.622/((p_atm/(RH*611*EXP(17.27*(Tl_cool/(Tl_cool+237.3))))))-1)*1000))/(1005*(((Tv_cool+Tr_cool)/2)-Tl_cool))))*1.039+((-0.000729*$C25+0.001448)*(Tl_cool-((Tv_cool+Tr_cool)/2))+(0.016908*$C25-0.033574))*1.039>1,1,1/(1+((2258*((0.622/((p_atm/(1*611*EXP(17.27*(((Tv_cool+Tr_cool)/2)/(((Tv_cool+Tr_cool)/2)+237.3))))))-1)*1000-(0.622/((p_atm/(RH*611*EXP(17.27*(Tl_cool/(Tl_cool+237.3))))))-1)*1000))/(1005*(((Tv_cool+Tr_cool)/2)-Tl_cool))))*1.039+((-0.000729*$C25+0.001448)*(Tl_cool-((Tv_cool+Tr_cool)/2))+(0.016908*$C25-0.033574))*1.039))))*$H$14","v":{"v":411.5524609078105,"d":"412"}},{"$f":"ROUND(((H25/$H$14)/((Tr_cool-Tv_cool)*1.163))*$I$14,IF($W$4=1,0,IF($W$4=2,2)))","v":59},{"v":0.14580188147753229,"d":"0.15"},36.8,44.8,7.2,223,{"$f":"(Tl_heat+(($D25/$G$14)/(1006*$N25*$K$14)))*(0.05*$C25+0.7)*$M$14+$O$14","v":{"v":43.9538943621044,"d":"44.0"}},{"$f":"(Tl_cool-((G25/$G$14)/(1006*N25*$K$14)))*$M$14+$O$14","v":{"v":20.349287370994467,"d":"20.3"}},null,null,{"v":1,"d":"1.000"},{"$nulls":3},-360.6249421804783,"b",0.9525315558861097,"b",44.8,7.2,223,"e",-348.72126254555525,"b",0.9505010322018387,"b",42.9,7.2,245,-13.4761765197598,"b",-0.7055344536484741,"b",42.9,5.7,158,-360.6249421804783,"b",0.9525315558861097,"b",44.8,7.2,223,-6.434274912644452,"b",-1.800745182102678,"b",44.8,5.7,144,122.05804505559311,"b",3.04623573523079,"b",42.6,5.7,262,-44.71995445671502,"b",2.358849174792185,"b",42.6,5.9,185,4.06086190704667,"b",2.4216316716249207,"b",42.4,5.7,238,-41.88656907342378,"b",1.970736777301756,"b",42.4,5.9,168]
[null,{"v":0.8,"d":"80%"},8,{"$f":"(($W$23*$C26^4+$W$24*$C26^3+$W$25*$C26^2+$W$26*$C26+$W$27)*((((Tv_heat-Tr_heat)/LN((Tv_heat-Tl_heat)/(Tr_heat-Tl_heat)))/((75-65)/LN((75-20)/(65-20))))^1))*$D$14*$AA$11","v":{"v":2243.0259004586364,"d":"2243"}},{"$f":"ROUND(((D26/$D$14)/((Tv_heat-Tr_heat)*1.163))*$E$14,IF($W$4=1,0,IF($W$4=2,2)))","v":193},{"v":1.2527236220879372,"d":"1.25"},{"$f":"(($Y$23*$C26^4+$Y$24*$C26^3+$Y$25*$C26^2+$Y$26*$C26+$Y$27)*((((Tv_cool-Tr_cool)/LN((Tv_cool-Tl_cool)/(Tr_cool-Tl_cool)))/((16-18)/LN((16-27)/(18-27))))^S26))*$G$14*$AA$11","v":{"v":410.8907276404598,"d":"411"}},{"$f":"((G26/$G$14)/(IF((237.3*LN((RH*EXP(17.27*(Tl_cool/(Tl_cool+237.3))))))/(17.27-LN((RH*EXP(17.27*(Tl_cool/(Tl_cool+237.3))))))<((Tv_cool+Tr_cool)/2),1,IF(1/(1+((2258*((0.622/((p_atm/(1*611*EXP(17.27*(((Tv_cool+Tr_cool)/2)/(((Tv_cool+Tr_cool)/2)+237.3))))))-1)*1000-(0.622/((p_atm/(RH*611*EXP(17.27*(Tl_cool/(Tl_cool+237.3))))))-1)*1000))/(1005*(((Tv_cool+Tr_cool)/2)-Tl_cool))))*1.039+((-0.000729*$C26+0.001448)*(Tl_cool-((Tv_cool+Tr_cool)/2))+(0.016908*$C26-0.033574))*1.039>1,1,1/(1+((2258*((0.622/((p_atm/(1*611*EXP(17.27*(((Tv_cool+Tr_cool)/2)/(((Tv_cool+Tr_cool)/2)+237.3))))))-1)*1000-(0.622/((p_atm/(RH*611*EXP(17.27*(Tl_cool/(Tl_cool+237.3))))))-1)*1000))/(1005*(((Tv_cool+Tr_cool)/2)-Tl_cool))))*1.039+((-0.000729*$C26+0.001448)*(Tl_cool-((Tv_cool+Tr_cool)/2))+(0.016908*$C26-0.033574))*1.039))))*$H$14","v":{"v":476.792583604443,"d":"477"}},{"$f":"ROUND(((H26/$H$14)/((Tr_cool-Tv_cool)*1.163))*$I$14,IF($W$4=1,0,IF($W$4=2,2)))","v":68},{"v":0.18865080689357502,"d":"0.19"},41.5,49.5,11.5,287,{"$f":"(Tl_heat+(($D26/$G$14)/(1006*$N26*$K$14)))*(0.05*$C26+0.7)*$M$14+$O$14","v":{"v":47.551894755698086,"d":"47.6"}},{"$f":"(Tl_cool-((G26/$G$14)/(1006*N26*$K$14)))*$M$14+$O$14","v":{"v":20.74477550550455,"d":"20.7"}},null,null,{"v":1,"d":"1.000"},{"$nulls":3},1211.686145735049,1.8148096460023067,6.878863960408994,1.8148096460023067,49.5,11.5,287,"f",1373.145051877896,1.8148096460023067,12.303694505562234,{"$f":"AF26","v":1.8148096460023067},48.7,11.5,315,117.51965864074985,{"$f":"AF26","v":1.8148096460023067},15.38147266772482,{"$f":"AH26","v":1.8148096460023067},48.7,8.4,213,1211.686145735049,{"$f":"AF26","v":1.8148096460023067},6.878863960408994,{"$f":"AO26","v":1.8148096460023067},49.5,11.5,287,80.73214551936076,{"$f":"AF26","v":1.8148096460023067},21.4930527859506,{"$f":"AH26","v":1.8148096460023067},49.5,8.4,194,-187.6715729709768,1.8208138694468972,15.003869299896744,{"$f":"BH26","v":1.8208138694468972},48.8,9.6,320,203.9442336709939,{"$f":"AF26","v":1.8148096460023067},13.520006569641618,{"$f":"BJ26","v":1.8208138694468972},48.8,{"v":10,"d":"10.0"},251,251.43285822089797,{"$f":"BH26","v":1.8208138694468972},20.92701538796936,{"$f":"BJ26","v":1.8208138694468972},47.9,9.6,291,185.13171418104602,{"$f":"BO26","v":1.8148096460023067},12.859546260831442,{"$f":"BQ26","v":1.8208138694468972},47.9,{"v":10,"d":"10.0"},228]
[null,{"v":1,"d":"100%"},10,{"$f":"(($W$23*$C27^4+$W$24*$C27^3+$W$25*$C27^2+$W$26*$C27+$W$27)*((((Tv_heat-Tr_heat)/LN((Tv_heat-Tl_heat)/(Tr_heat-Tl_heat)))/((75-65)/LN((75-20)/(65-20))))^1))*$D$14*$AA$11","v":{"v":2749.2183050241524,"d":"2749"}},{"$f":"ROUND(((D27/$D$14)/((Tv_heat-Tr_heat)*1.163))*$E$14,IF($W$4=1,0,IF($W$4=2,2)))","v":236},{"v":1.8046268223295128,"d":"1.80"},{"$f":"(($Y$23*$C27^4+$Y$24*$C27^3+$Y$25*$C27^2+$Y$26*$C27+$Y$27)*((((Tv_cool-Tr_cool)/LN((Tv_cool-Tl_cool)/(Tr_cool-Tl_cool)))/((16-18)/LN((16-27)/(18-27))))^S27))*$G$14*$AA$11","v":{"v":487.30403696813084,"d":"487"}},{"$f":"((G27/$G$14)/(IF((237.3*LN((RH*EXP(17.27*(Tl_cool/(Tl_cool+237.3))))))/(17.27-LN((RH*EXP(17.27*(Tl_cool/(Tl_cool+237.3))))))<((Tv_cool+Tr_cool)/2),1,IF(1/(1+((2258*((0.622/((p_atm/(1*611*EXP(17.27*(((Tv_cool+Tr_cool)/2)/(((Tv_cool+Tr_cool)/2)+237.3))))))-1)*1000-(0.622/((p_atm/(RH*611*EXP(17.27*(Tl_cool/(Tl_cool+237.3))))))-1)*1000))/(1005*(((Tv_cool+Tr_cool)/2)-Tl_cool))))*1.039+((-0.000729*$C27+0.001448)*(Tl_cool-((Tv_cool+Tr_cool)/2))+(0.016908*$C27-0.033574))*1.039>1,1,1/(1+((2258*((0.622/((p_atm/(1*611*EXP(17.27*(((Tv_cool+Tr_cool)/2)/(((Tv_cool+Tr_cool)/2)+237.3))))))-1)*1000-(0.622/((p_atm/(RH*611*EXP(17.27*(Tl_cool/(Tl_cool+237.3))))))-1)*1000))/(1005*(((Tv_cool+Tr_cool)/2)-Tl_cool))))*1.039+((-0.000729*$C27+0.001448)*(Tl_cool-((Tv_cool+Tr_cool)/2))+(0.016908*$C27-0.033574))*1.039))))*$H$14","v":{"v":556.4688742515888,"d":"556"}},{"$f":"ROUND(((H27/$H$14)/((Tr_cool-Tv_cool)*1.163))*$I$14,IF($W$4=1,0,IF($W$4=2,2)))","v":80},{"v":0.25336690219813474,"d":"0.25"},44.5,52.5,{"v":18,"d":"18.0"},346,{"$f":"(Tl_heat+(($D27/$G$14)/(1006*$N27*$K$14)))*(0.05*$C27+0.7)*$M$14+$O$14","v":{"v":52.339514593980184,"d":"52.3"}},{"$f":"(Tl_cool-((G27/$G$14)/(1006*N27*$K$14)))*$M$14+$O$14","v":{"v":20.81397378722577,"d":"20.8"}},null,null,{"v":1,"d":"1.000"},{"$nulls":3},237.14568715178913,0,173.5639004431571,0,52.5,18,346,"g",-15.100612121165774,null,169.35574429693057,null,{"v":53,"d":"53.0"},{"v":18,"d":"18.0"},380,1150.1568462090017,null,135.99082694968888,null,{"v":53,"d":"53.0"},14.4,252,237.14568715178913,null,173.5639004431571,null,52.5,{"v":18,"d":"18.0"},346,1067.2269380900811,null,110.71690101532077,null,52.5,14.4,229,2449.938064016802,null,278.2573075912911,null,{"v":53,"d":"53.0"},15.6,365,781.2037567155606,null,197.77175399650883,null,{"v":53,"d":"53.0"},15.6,282,1733.6902910445228,null,244.82210443399327,null,51.5,15.6,332,758.5353119327127,null,192.26108685256855,null,51.5,15.6,257]
[null,{"$f":"IF($S$7=1,NL!B28,IF(cal!$S$7=2,EN!B28,IF(cal!$S$7=3,DE!B28,IF(cal!$S$7=4,FR!B28,IF(cal!$S$7=5,NR!B28,IF(cal!$S$7=6,SP!B28,IF(cal!$S$7=7,SW!B28,IF(cal!$S$7=8,TS!B28,IF(cal!$S$7=9,ExtraTaal1!B28,IF(cal!$S$7=10,ExtraTaal2!B28,IF(cal!$S$7=11,ExtraTaal3!B28,)))))))))))","v":"Briza 12 hoogte 41 cm breedte 14 cm lengte 125 cm (Type 3)"},{"$f":"IF($S$7=1,NL!C28,IF(cal!$S$7=2,EN!C28,IF(cal!$S$7=3,DE!C28,IF(cal!$S$7=4,FR!C28,IF(cal!$S$7=5,NR!C28,IF(cal!$S$7=6,SP!C28,))))))","v":0},{"$f":"IF($S$7=1,NL!D28,IF(cal!$S$7=2,EN!D28,IF(cal!$S$7=3,DE!D28,IF(cal!$S$7=4,FR!D28,IF(cal!$S$7=5,NR!D28,IF(cal!$S$7=6,SP!D28,))))))","v":0},{"$f":"IF($S$7=1,NL!E28,IF(cal!$S$7=2,EN!E28,IF(cal!$S$7=3,DE!E28,IF(cal!$S$7=4,FR!E28,IF(cal!$S$7=5,NR!E28,IF(cal!$S$7=6,SP!E28,))))))","v":0},{"$f":"IF($S$7=1,NL!F28,IF(cal!$S$7=2,EN!F28,IF(cal!$S$7=3,DE!F28,IF(cal!$S$7=4,FR!F28,IF(cal!$S$7=5,NR!F28,IF(cal!$S$7=6,SP!F28,))))))","v":0},{"$f":"IF($S$7=1,NL!G28,IF(cal!$S$7=2,EN!G28,IF(cal!$S$7=3,DE!G28,IF(cal!$S$7=4,FR!G28,IF(cal!$S$7=5,NR!G28,IF(cal!$S$7=6,SP!G28,))))))","v":0},{"$f":"IF($S$7=1,NL!H28,IF(cal!$S$7=2,EN!H28,IF(cal!$S$7=3,DE!H28,IF(cal!$S$7=4,FR!H28,IF(cal!$S$7=5,NR!H28,IF(cal!$S$7=6,SP!H28,))))))","v":0},{"$f":"IF($S$7=1,NL!I28,IF(cal!$S$7=2,EN!I28,IF(cal!$S$7=3,DE!I28,IF(cal!$S$7=4,FR!I28,IF(cal!$S$7=5,NR!I28,IF(cal!$S$7=6,SP!I28,))))))","v":0},{"$f":"IF($S$7=1,NL!J28,IF(cal!$S$7=2,EN!J28,IF(cal!$S$7=3,DE!J28,IF(cal!$S$7=4,FR!J28,IF(cal!$S$7=5,NR!J28,IF(cal!$S$7=6,SP!J28,))))))","v":0},{"$f":"IF($S$7=1,NL!K28,IF(cal!$S$7=2,EN!K28,IF(cal!$S$7=3,DE!K28,IF(cal!$S$7=4,FR!K28,IF(cal!$S$7=5,NR!K28,IF(cal!$S$7=6,SP!K28,))))))","v":0},{"$f":"IF($S$7=1,NL!L28,IF(cal!$S$7=2,EN!L28,IF(cal!$S$7=3,DE!L28,IF(cal!$S$7=4,FR!L28,IF(cal!$S$7=5,NR!L28,IF(cal!$S$7=6,SP!L28,))))))","v":0},{"$f":"IF($S$7=1,NL!M28,IF(cal!$S$7=2,EN!M28,IF(cal!$S$7=3,DE!M28,IF(cal!$S$7=4,FR!M28,IF(cal!$S$7=5,NR!M28,IF(cal!$S$7=6,SP!M28,))))))","v":0},{"$f":"IF($S$7=1,NL!N28,IF(cal!$S$7=2,EN!N28,IF(cal!$S$7=3,DE!N28,IF(cal!$S$7=4,FR!N28,IF(cal!$S$7=5,NR!N28,IF(cal!$S$7=6,SP!N28,))))))","v":0},{"$f":"IF($S$7=1,NL!O28,IF(cal!$S$7=2,EN!O28,IF(cal!$S$7=3,DE!O28,IF(cal!$S$7=4,FR!O28,IF(cal!$S$7=5,NR!O28,IF(cal!$S$7=6,SP!O28,))))))","v":0},{"$f":"IF($S$7=1,NL!P28,IF(cal!$S$7=2,EN!P28,IF(cal!$S$7=3,DE!P28,IF(cal!$S$7=4,FR!P28,IF(cal!$S$7=5,NR!P28,IF(cal!$S$7=6,SP!P28,))))))","v":0},null,null,"n-value",{"$nulls":3},"H",{"v":41,"d":"41.0"},"B",{"v":14,"d":"14.0"},"L",{"v":95,"d":"95.0"},null,null,"H",{"$f":"38*IF($W$4=1,1,IF($W$4=2,1/2.54))","v":38},"B",{"$f":"12*IF($W$4=1,1,IF($W$4=2,1/2.54))","v":12},"L",{"$f":"72*IF($W$4=1,1,IF($W$4=2,1/2.54))","v":72},null,"H",{"$f":"38*IF($W$4=1,1,IF($W$4=2,1/2.54))","v":38},"B",{"$f":"12*IF($W$4=1,1,IF($W$4=2,1/2.54))","v":12},"L",{"$f":"72*IF($W$4=1,1,IF($W$4=2,1/2.54))","v":72},null,"H",{"$f":"41*IF($W$4=1,1,IF($W$4=2,1/2.54))","v":41},"B",{"$f":"14*IF($W$4=1,1,IF($W$4=2,1/2.54))","v":14},"L",{"$f":"95*IF($W$4=1,1,IF($W$4=2,1/2.54))","v":95},null,"H",{"$f":"41*IF($W$4=1,1,IF($W$4=2,1/2.54))","v":41},"B",{"$f":"14*IF($W$4=1,1,IF($W$4=2,1/2.54))","v":14},"L",{"$f":"95*IF($W$4=1,1,IF($W$4=2,1/2.54))","v":95},null,"H",{"$f":"52*IF($W$4=1,1,IF($W$4=2,1/2.54))","v":52},"B",{"$f":"12*IF($W$4=1,1,IF($W$4=2,1/2.54))","v":12},"L",{"$f":"72*IF($W$4=1,1,IF($W$4=2,1/2.54))","v":72},null,"H",{"$f":"52*IF($W$4=1,1,IF($W$4=2,1/2.54))","v":52},"B",{"$f":"12*IF($W$4=1,1,IF($W$4=2,1/2.54))","v":12},"L",{"$f":"72*IF($W$4=1,1,IF($W$4=2,1/2.54))","v":72},null,"H",{"$f":"55*IF($W$4=1,1,IF($W$4=2,1/2.54))","v":55},"B",{"$f":"14*IF($W$4=1,1,IF($W$4=2,1/2.54))","v":14},"L",{"$f":"95*IF($W$4=1,1,IF($W$4=2,1/2.54))","v":95},null,"H",{"$f":"55*IF($W$4=1,1,IF($W$4=2,1/2.54))","v":55},"B",{"$f":"14*IF($W$4=1,1,IF($W$4=2,1/2.54))","v":14},"L",{"$f":"95*IF($W$4=1,1,IF($W$4=2,1/2.54))","v":95}]
[null,{"v":0.2,"d":"20%"},2,{"$f":"(($W$29*$C29^4+$W$30*$C29^3+$W$31*$C29^2+$W$32*$C29+$W$33)*((((Tv_heat-Tr_heat)/LN((Tv_heat-Tl_heat)/(Tr_heat-Tl_heat)))/((75-65)/LN((75-20)/(65-20))))^1))*$D$14*$AA$11","v":{"v":2430.7625854019607,"d":"2431"}},{"$f":"ROUND(((D29/$D$14)/((Tv_heat-Tr_heat)*1.163))*$E$14,IF($W$4=1,0,IF($W$4=2,2)))","v":209},{"$f":"($X$30*(E29/$E$14)^$X$32)*$F$14","v":{"v":1.9543348859943828,"d":"1.95"}},{"$f":"(($Y$29*$C29^4+$Y$30*$C29^3+$Y$31*$C29^2+$Y$32*$C29+$Y$33)*((((Tv_cool-Tr_cool)/LN((Tv_cool-Tl_cool)/(Tr_cool-Tl_cool)))/((16-18)/LN((16-27)/(18-27))))^S29))*$G$14*$AA$11","v":{"v":433.432567511191,"d":"433"}},{"$f":"((G29/$G$14)/(IF((237.3*LN((RH*EXP(17.27*(Tl_cool/(Tl_cool+237.3))))))/(17.27-LN((RH*EXP(17.27*(Tl_cool/(Tl_cool+237.3))))))<((Tv_cool+Tr_cool)/2),1,IF(1/(1+((2258*((0.622/((p_atm/(1*611*EXP(17.27*(((Tv_cool+Tr_cool)/2)/(((Tv_cool+Tr_cool)/2)+237.3))))))-1)*1000-(0.622/((p_atm/(RH*611*EXP(17.27*(Tl_cool/(Tl_cool+237.3))))))-1)*1000))/(1005*(((Tv_cool+Tr_cool)/2)-Tl_cool))))*1.039+((-0.000729*$C29+0.001448)*(Tl_cool-((Tv_cool+Tr_cool)/2))+(0.016908*$C29-0.033574))*1.039>1,1,1/(1+((2258*((0.622/((p_atm/(1*611*EXP(17.27*(((Tv_cool+Tr_cool)/2)/(((Tv_cool+Tr_cool)/2)+237.3))))))-1)*1000-(0.622/((p_atm/(RH*611*EXP(17.27*(Tl_cool/(Tl_cool+237.3))))))-1)*1000))/(1005*(((Tv_cool+Tr_cool)/2)-Tl_cool))))*1.039+((-0.000729*$C29+0.001448)*(Tl_cool-((Tv_cool+Tr_cool)/2))+(0.016908*$C29-0.033574))*1.039))))*$H$14","v":{"v":528.575913612012,"d":"529"}},{"$f":"ROUND(((H29/$H$14)/((Tr_cool-Tv_cool)*1.163))*$I$14,IF($W$4=1,0,IF($W$4=2,2)))","v":76},{"$f":"($Z$30*(I29/$I$14)^$Z$32)*$J$14","v":{"v":0.311747050009198,"d":"0.31"}},{"$f":"L29-8","v":24.6},{"$f":"AA29","v":32.6},{"$f":"AB29","v":2.6},{"$f":"AC29*$N$14","v":146},{"$f":"(Tl_heat+(($D29/$G$14)/(1006*$N29*$K$14)))*(0.05*$C29+0.7)*$M$14+$O$14","v":{"v":55.587466361196896,"d":"55.6"}},{"$f":"(Tl_cool-((G29/$G$14)/(1006*N29*$K$14)))*$M$14+$O$14","v":{"v":16.1763815966425,"d":"16.2"}},null,null,{"v":1,"d":"1.000"},{"$nulls":3},{"$f":"IF($W$16=1,AE29,IF($W$16=2,AL29,IF($W$16=3,AS29,IF($W$16=4,AZ29,IF($W$16=5,BG29,IF($W$16=6,BN29,IF($W$16=7,BU29,IF($W$16=8,CB29))))))))","v":-2.6386736307091345E-3},{"$f":"IF($W$16=1,AF29,IF($W$16=2,AM29,IF($W$16=3,AT29,IF($W$16=4,BA29,IF($W$16=5,BH29,IF($W$16=6,BO29,IF($W$16=7,BV29,IF($W$16=8,CC29))))))))","v":"a"},{"$f":"IF($W$16=1,AG29,IF($W$16=2,AN29,IF($W$16=3,AU29,IF($W$16=4,BB29,IF($W$16=5,BI29,IF($W$16=6,BP29,IF($W$16=7,BW29,IF($W$16=8,CD29))))))))","v":0},{"$f":"IF($W$16=1,AH29,IF($W$16=2,AO29,IF($W$16=3,AV29,IF($W$16=4,BC29,IF($W$16=5,BJ29,IF($W$16=6,BQ29,IF($W$16=7,BX29,IF($W$16=8,CE29))))))))","v":"a"},{"$f":"IF($W$16=1,AI29,IF($W$16=2,AP29,IF($W$16=3,AW29,IF($W$16=4,BD29,IF($W$16=5,BK29,IF($W$16=6,BR29,IF($W$16=7,BY29,IF($W$16=8,CF29))))))))","v":32.6},{"$f":"IF($W$16=1,AJ29,IF($W$16=2,AQ29,IF($W$16=3,AX29,IF($W$16=4,BE29,IF($W$16=5,BL29,IF($W$16=6,BS29,IF($W$16=7,BZ29,IF($W$16=8,CG29))))))))","v":2.6},{"$f":"IF($W$16=1,AK29,IF($W$16=2,AR29,IF($W$16=3,AY29,IF($W$16=4,BF29,IF($W$16=5,BM29,IF($W$16=6,BT29,IF($W$16=7,CA29,IF($W$16=8,CH29))))))))","v":146},"c",-2.3255187064524967,"a",null,"a",31.1,2.6,160,null,"a",null,"a",{"$f":"AI29","v":31.1},2.3,80,-2.6386736307091345E-3,"a",null,"a",32.6,{"$f":"AJ29","v":2.6},146,null,"a",null,"a",{"$f":"AW29","v":32.6},{"$f":"AQ29","v":2.3},73,0.49898569310107377,"a",null,"a",{"v":32,"d":"32.0"},2.8,168,null,"a",0.06630157722371298,"a",{"$f":"BK29","v":{"v":32,"d":"32.0"}},2.3,123,null,"a",null,"a",31.1,{"$f":"BL29","v":2.8},153,-0.26784940737322377,"a",null,"a",{"$f":"BY29","v":31.1},{"$f":"BS29","v":2.3},112]
[null,{"v":0.4,"d":"40%"},4,{"$f":"(($W$29*$C30^4+$W$30*$C30^3+$W$31*$C30^2+$W$32*$C30+$W$33)*((((Tv_heat-Tr_heat)/LN((Tv_heat-Tl_heat)/(Tr_heat-Tl_heat)))/((75-65)/LN((75-20)/(65-20))))^1))*$D$14*$AA$11","v":{"v":2716.94544387916,"d":"2717"}},{"$f":"ROUND(((D30/$D$14)/((Tv_heat-Tr_heat)*1.163))*$E$14,IF($W$4=1,0,IF($W$4=2,2)))","v":234},{"$f":"($X$30*(E30/$E$14)^$X$32)*$F$14","v":{"v":2.399047177794451,"d":"2.40"}},{"$f":"(($Y$29*$C30^4+$Y$30*$C30^3+$Y$31*$C30^2+$Y$32*$C30+$Y$33)*((((Tv_cool-Tr_cool)/LN((Tv_cool-Tl_cool)/(Tr_cool-Tl_cool)))/((16-18)/LN((16-27)/(18-27))))^S30))*$G$14*$AA$11","v":{"v":479.841731112975,"d":"480"}},{"$f":"((G30/$G$14)/(IF((237.3*LN((RH*EXP(17.27*(Tl_cool/(Tl_cool+237.3))))))/(17.27-LN((RH*EXP(17.27*(Tl_cool/(Tl_cool+237.3))))))<((Tv_cool+Tr_cool)/2),1,IF(1/(1+((2258*((0.622/((p_atm/(1*611*EXP(17.27*(((Tv_cool+Tr_cool)/2)/(((Tv_cool+Tr_cool)/2)+237.3))))))-1)*1000-(0.622/((p_atm/(RH*611*EXP(17.27*(Tl_cool/(Tl_cool+237.3))))))-1)*1000))/(1005*(((Tv_cool+Tr_cool)/2)-Tl_cool))))*1.039+((-0.000729*$C30+0.001448)*(Tl_cool-((Tv_cool+Tr_cool)/2))+(0.016908*$C30-0.033574))*1.039>1,1,1/(1+((2258*((0.622/((p_atm/(1*611*EXP(17.27*(((Tv_cool+Tr_cool)/2)/(((Tv_cool+Tr_cool)/2)+237.3))))))-1)*1000-(0.622/((p_atm/(RH*611*EXP(17.27*(Tl_cool/(Tl_cool+237.3))))))-1)*1000))/(1005*(((Tv_cool+Tr_cool)/2)-Tl_cool))))*1.039+((-0.000729*$C30+0.001448)*(Tl_cool-((Tv_cool+Tr_cool)/2))+(0.016908*$C30-0.033574))*1.039))))*$H$14","v":{"v":575.3999150527252,"d":"575"}},{"$f":"ROUND(((H30/$H$14)/((Tr_cool-Tv_cool)*1.163))*$I$14,IF($W$4=1,0,IF($W$4=2,2)))","v":82},{"$f":"($Z$30*(I30/$I$14)^$Z$32)*$J$14","v":{"v":0.3578354698326758,"d":"0.36"}},{"v":30.200000000000003,"d":"30.2"},38.2,4.8,221,{"$f":"(Tl_heat+(($D30/$G$14)/(1006*$N30*$K$14)))*(0.05*$C30+0.7)*$M$14+$O$14","v":{"v":50.885858725701176,"d":"50.9"}},{"$f":"(Tl_cool-((G30/$G$14)/(1006*N30*$K$14)))*$M$14+$O$14","v":{"v":18.54667147516013,"d":"18.5"}},null,null,{"v":1,"d":"1.000"},{"$nulls":3},1.4785661107548795,1.2048931502827451E-4,0.09571949914823337,1.2048931502827451E-4,38.2,4.8,221,"d",61.93065910250884,1.2048931502827451E-4,null,{"$f":"AF30","v":1.2048931502827451E-4},{"v":38,"d":"38.0"},4.8,243,1.6137056094442337,{"$f":"AF30","v":1.2048931502827451E-4},0.1508165175074657,{"$f":"AH30","v":1.2048931502827451E-4},{"v":38,"d":"38.0"},4.1,164,1.4785661107548795,{"$f":"AF30","v":1.2048931502827451E-4},0.09571949914823337,{"$f":"AO30","v":1.2048931502827451E-4},38.2,4.8,221,1.0636516905207274,{"$f":"AF30","v":1.2048931502827451E-4},0.17123517161163615,{"$f":"AH30","v":1.2048931502827451E-4},38.2,4.1,149,-14.0765186386179,2.364386444169621E-4,-0.4636209245002835,{"$f":"BH30","v":2.364386444169621E-4},38.3,5.4,259,1.551976572648176,{"$f":"AF30","v":1.2048931502827451E-4},-1.8213867274960225,{"$f":"BJ30","v":2.364386444169621E-4},38.3,4.2,201,-0.8815084963588697,{"$f":"BH30","v":2.364386444169621E-4},-0.2615692786811772,{"$f":"BJ30","v":2.364386444169621E-4},37.1,5.4,236,7.545208833492138,{"$f":"BO30","v":1.2048931502827451E-4},-0.20123481722729702,{"$f":"BQ30","v":2.364386444169621E-4},37.1,4.2,183]
[null,{"v":0.6,"d":"60%"},6,{"$f":"(($W$29*$C31^4+$W$30*$C31^3+$W$31*$C31^2+$W$32*$C31+$W$33)*((((Tv_heat-Tr_heat)/LN((Tv_heat-Tl_heat)/(Tr_heat-Tl_heat)))/((75-65)/LN((75-20)/(65-20))))^1))*$D$14*$AA$11","v":{"v":3089.5460115724723,"d":"3090"}},{"$f":"ROUND(((D31/$D$14)/((Tv_heat-Tr_heat)*1.163))*$E$14,IF($W$4=1,0,IF($W$4=2,2)))","v":266},{"v":3.0272467676397294,"d":"3.03"},{"$f":"(($Y$29*$C31^4+$Y$30*$C31^3+$Y$31*$C31^2+$Y$32*$C31+$Y$33)*((((Tv_cool-Tr_cool)/LN((Tv_cool-Tl_cool)/(Tr_cool-Tl_cool)))/((16-18)/LN((16-27)/(18-27))))^S31))*$G$14*$AA$11","v":{"v":547.619069812628,"d":"548"}},{"$f":"((G31/$G$14)/(IF((237.3*LN((RH*EXP(17.27*(Tl_cool/(Tl_cool+237.3))))))/(17.27-LN((RH*EXP(17.27*(Tl_cool/(Tl_cool+237.3))))))<((Tv_cool+Tr_cool)/2),1,IF(1/(1+((2258*((0.622/((p_atm/(1*611*EXP(17.27*(((Tv_cool+Tr_cool)/2)/(((Tv_cool+Tr_cool)/2)+237.3))))))-1)*1000-(0.622/((p_atm/(RH*611*EXP(17.27*(Tl_cool/(Tl_cool+237.3))))))-1)*1000))/(1005*(((Tv_cool+Tr_cool)/2)-Tl_cool))))*1.039+((-0.000729*$C31+0.001448)*(Tl_cool-((Tv_cool+Tr_cool)/2))+(0.016908*$C31-0.033574))*1.039>1,1,1/(1+((2258*((0.622/((p_atm/(1*611*EXP(17.27*(((Tv_cool+Tr_cool)/2)/(((Tv_cool+Tr_cool)/2)+237.3))))))-1)*1000-(0.622/((p_atm/(RH*611*EXP(17.27*(Tl_cool/(Tl_cool+237.3))))))-1)*1000))/(1005*(((Tv_cool+Tr_cool)/2)-Tl_cool))))*1.039+((-0.000729*$C31+0.001448)*(Tl_cool-((Tv_cool+Tr_cool)/2))+(0.016908*$C31-0.033574))*1.039))))*$H$14","v":{"v":645.8883203973475,"d":"646"}},{"$f":"ROUND(((H31/$H$14)/((Tr_cool-Tv_cool)*1.163))*$I$14,IF($W$4=1,0,IF($W$4=2,2)))","v":93},{"v":0.44965960948814393,"d":"0.45"},{"v":37,"d":"37.0"},{"v":45,"d":"45.0"},{"v":8,"d":"8.0"},298,{"$f":"(Tl_heat+(($D31/$G$14)/(1006*$N31*$K$14)))*(0.05*$C31+0.7)*$M$14+$O$14","v":{"v":50.81459303683383,"d":"50.8"}},{"$f":"(Tl_cool-((G31/$G$14)/(1006*N31*$K$14)))*$M$14+$O$14","v":{"v":19.53814291411151,"d":"19.5"}},null,null,{"v":1,"d":"1.000"},{"$nulls":3},-6.676712313973501,"b",0.7827958312026129,"b",45,8,298,"e",-556.9381723226224,"b",2.4192032034123994,"b",{"v":46,"d":"46.0"},{"v":8,"d":"8.0"},328,-14.064601457374017,"b",-0.6754723602804349,"b",{"v":46,"d":"46.0"},7.4,242,-6.676712313973501,"b",0.7827958312026129,"b",{"v":45,"d":"45.0"},{"v":8,"d":"8.0"},298,-4.235884897558331,"b",-1.4664081399657958,"b",{"v":45,"d":"45.0"},7.4,220,136.64465681006797,"b",8.74235602722158,"b",45.7,{"v":10,"d":"10.0"},353,-16.256862097163722,"b",17.495928000536857,"b",45.7,7.5,286,10.601704948047237,"b",4.67346178430048,"b",44.5,{"v":10,"d":"10.0"},321,-62.125133979184696,"b",3.3370194060807656,"b",44.5,7.5,260]
[null,{"v":0.8,"d":"80%"},8,{"$f":"(($W$29*$C32^4+$W$30*$C32^3+$W$31*$C32^2+$W$32*$C32+$W$33)*((((Tv_heat-Tr_heat)/LN((Tv_heat-Tl_heat)/(Tr_heat-Tl_heat)))/((75-65)/LN((75-20)/(65-20))))^1))*$D$14*$AA$11","v":{"v":3617.002335112651,"d":"3617"}},{"$f":"ROUND(((D32/$D$14)/((Tv_heat-Tr_heat)*1.163))*$E$14,IF($W$4=1,0,IF($W$4=2,2)))","v":311},{"v":4.019926040404012,"d":"4.02"},{"$f":"(($Y$29*$C32^4+$Y$30*$C32^3+$Y$31*$C32^2+$Y$32*$C32+$Y$33)*((((Tv_cool-Tr_cool)/LN((Tv_cool-Tl_cool)/(Tr_cool-Tl_cool)))/((16-18)/LN((16-27)/(18-27))))^S32))*$G$14*$AA$11","v":{"v":643.1184805911148,"d":"643"}},{"$f":"((G32/$G$14)/(IF((237.3*LN((RH*EXP(17.27*(Tl_cool/(Tl_cool+237.3))))))/(17.27-LN((RH*EXP(17.27*(Tl_cool/(Tl_cool+237.3))))))<((Tv_cool+Tr_cool)/2),1,IF(1/(1+((2258*((0.622/((p_atm/(1*611*EXP(17.27*(((Tv_cool+Tr_cool)/2)/(((Tv_cool+Tr_cool)/2)+237.3))))))-1)*1000-(0.622/((p_atm/(RH*611*EXP(17.27*(Tl_cool/(Tl_cool+237.3))))))-1)*1000))/(1005*(((Tv_cool+Tr_cool)/2)-Tl_cool))))*1.039+((-0.000729*$C32+0.001448)*(Tl_cool-((Tv_cool+Tr_cool)/2))+(0.016908*$C32-0.033574))*1.039>1,1,1/(1+((2258*((0.622/((p_atm/(1*611*EXP(17.27*(((Tv_cool+Tr_cool)/2)/(((Tv_cool+Tr_cool)/2)+237.3))))))-1)*1000-(0.622/((p_atm/(RH*611*EXP(17.27*(Tl_cool/(Tl_cool+237.3))))))-1)*1000))/(1005*(((Tv_cool+Tr_cool)/2)-Tl_cool))))*1.039+((-0.000729*$C32+0.001448)*(Tl_cool-((Tv_cool+Tr_cool)/2))+(0.016908*$C32-0.033574))*1.039))))*$H$14","v":{"v":746.266832755385,"d":"746"}},{"$f":"ROUND(((H32/$H$14)/((Tr_cool-Tv_cool)*1.163))*$I$14,IF($W$4=1,0,IF($W$4=2,2)))","v":107},{"v":0.5799522528835347,"d":"0.58"},42.5,50.5,{"v":14,"d":"14.0"},381,{"$f":"(Tl_heat+(($D32/$G$14)/(1006*$N32*$K$14)))*(0.05*$C32+0.7)*$M$14+$O$14","v":{"v":53.03805738533397,"d":"53.0"}},{"$f":"(Tl_cool-((G32/$G$14)/(1006*N32*$K$14)))*$M$14+$O$14","v":{"v":19.98300062347721,"d":"20.0"}},null,null,{"v":1,"d":"1.000"},{"$nulls":3},142.06849285698914,1.8145625016160318,9.402432844199659,1.8145625016160318,50.5,14,381,"f",2180.468988373019,1.8145625016160318,7.018076693344182,{"$f":"AF32","v":1.8145625016160318},{"v":52,"d":"52.0"},{"v":14,"d":"14.0"},419,185.79907596861634,{"$f":"AF32","v":1.8145625016160318},17.105182113376028,{"$f":"AH32","v":1.8145625016160318},{"v":52,"d":"52.0"},12.6,305,142.06849285698914,{"$f":"AF32","v":1.8145625016160318},9.402432844199659,{"$f":"AO32","v":1.8145625016160318},50.5,{"v":14,"d":"14.0"},381,114.94135317144828,{"$f":"AF32","v":1.8145625016160318},22.25052488649974,{"$f":"AH32","v":1.8145625016160318},50.5,12.6,278,-107.32250508333314,1.8120794599034276,4.113377897297812,{"$f":"BH32","v":1.8120794599034276},51.7,{"v":18,"d":"18.0"},437,174.26190449452022,{"$f":"AF32","v":1.8145625016160318},-28.250535183194774,{"$f":"BJ32","v":1.8120794599034276},51.7,12.8,360,390.82080301438873,{"$f":"BH32","v":1.8120794599034276},26.676957361613045,{"$f":"BJ32","v":1.8120794599034276},50.5,{"v":18,"d":"18.0"},398,307.8019217888039,{"$f":"BO32","v":1.8145625016160318},23.256603866829582,{"$f":"BQ32","v":1.8120794599034276},50.5,12.8,328]
[null,{"v":1,"d":"100%"},10,{"$f":"(($W$29*$C33^4+$W$30*$C33^3+$W$31*$C33^2+$W$32*$C33+$W$33)*((((Tv_heat-Tr_heat)/LN((Tv_heat-Tl_heat)/(Tr_heat-Tl_heat)))/((75-65)/LN((75-20)/(65-20))))^1))*$D$14*$AA$11","v":{"v":4366.739210456259,"d":"4367"}},{"$f":"ROUND(((D33/$D$14)/((Tv_heat-Tr_heat)*1.163))*$E$14,IF($W$4=1,0,IF($W$4=2,2)))","v":375},{"v":5.64532763428131,"d":"5.65"},{"$f":"(($Y$29*$C33^4+$Y$30*$C33^3+$Y$31*$C33^2+$Y$32*$C33+$Y$33)*((((Tv_cool-Tr_cool)/LN((Tv_cool-Tl_cool)/(Tr_cool-Tl_cool)))/((16-18)/LN((16-27)/(18-27))))^S33))*$G$14*$AA$11","v":{"v":772.6938604293996,"d":"773"}},{"$f":"((G33/$G$14)/(IF((237.3*LN((RH*EXP(17.27*(Tl_cool/(Tl_cool+237.3))))))/(17.27-LN((RH*EXP(17.27*(Tl_cool/(Tl_cool+237.3))))))<((Tv_cool+Tr_cool)/2),1,IF(1/(1+((2258*((0.622/((p_atm/(1*611*EXP(17.27*(((Tv_cool+Tr_cool)/2)/(((Tv_cool+Tr_cool)/2)+237.3))))))-1)*1000-(0.622/((p_atm/(RH*611*EXP(17.27*(Tl_cool/(Tl_cool+237.3))))))-1)*1000))/(1005*(((Tv_cool+Tr_cool)/2)-Tl_cool))))*1.039+((-0.000729*$C33+0.001448)*(Tl_cool-((Tv_cool+Tr_cool)/2))+(0.016908*$C33-0.033574))*1.039>1,1,1/(1+((2258*((0.622/((p_atm/(1*611*EXP(17.27*(((Tv_cool+Tr_cool)/2)/(((Tv_cool+Tr_cool)/2)+237.3))))))-1)*1000-(0.622/((p_atm/(RH*611*EXP(17.27*(Tl_cool/(Tl_cool+237.3))))))-1)*1000))/(1005*(((Tv_cool+Tr_cool)/2)-Tl_cool))))*1.039+((-0.000729*$C33+0.001448)*(Tl_cool-((Tv_cool+Tr_cool)/2))+(0.016908*$C33-0.033574))*1.039))))*$H$14","v":{"v":882.3651150716456,"d":"882"}},{"$f":"ROUND(((H33/$H$14)/((Tr_cool-Tv_cool)*1.163))*$I$14,IF($W$4=1,0,IF($W$4=2,2)))","v":126},{"v":0.780193209619803,"d":"0.78"},{"v":47,"d":"47.0"},{"v":55,"d":"55.0"},{"v":24,"d":"24.0"},448,{"$f":"(Tl_heat+(($D33/$G$14)/(1006*$N33*$K$14)))*(0.05*$C33+0.7)*$M$14+$O$14","v":{"v":58.76470280191157,"d":"58.8"}},{"$f":"(Tl_cool-((G33/$G$14)/(1006*N33*$K$14)))*$M$14+$O$14","v":{"v":19.87365913098134,"d":"19.9"}},null,null,{"v":1,"d":"1.000"},{"$nulls":3},2161.5461388359286,0,290.7155392231125,0,55,24,448,"g",12.559735529856832,null,302.4141340344674,null,56.5,{"v":24,"d":"24.0"},492,1773.7132602943027,null,237.24710921217832,null,56.5,20.9,400,2161.5461388359286,null,290.7155392231125,null,{"v":55,"d":"55.0"},{"v":24,"d":"24.0"},448,1703.0145175312946,null,199.95460885224878,null,{"v":55,"d":"55.0"},20.9,364,3667.2959327216463,null,468.36560109162576,null,{"v":56,"d":"56.0"},28.8,513,1354.4188592106093,null,381.7681116328352,null,{"v":56,"d":"56.0"},22.3,423,2743.7411285852236,null,404.4385594902665,null,54.5,28.8,467,1146.7350020499362,null,292.495395595261,null,54.5,22.3,385]
[null,{"$f":"IF($S$7=1,NL!B34,IF(cal!$S$7=2,EN!B34,IF(cal!$S$7=3,DE!B34,IF(cal!$S$7=4,FR!B34,IF(cal!$S$7=5,NR!B34,IF(cal!$S$7=6,SP!B34,IF(cal!$S$7=7,SW!B34,IF(cal!$S$7=8,TS!B34,IF(cal!$S$7=9,ExtraTaal1!B34,IF(cal!$S$7=10,ExtraTaal2!B34,IF(cal!$S$7=11,ExtraTaal3!B34,)))))))))))","v":"Briza 12 hoogte 41 cm breedte 14 cm lengte 145 cm (Type 4)"},{"$f":"IF($S$7=1,NL!C34,IF(cal!$S$7=2,EN!C34,IF(cal!$S$7=3,DE!C34,IF(cal!$S$7=4,FR!C34,IF(cal!$S$7=5,NR!C34,IF(cal!$S$7=6,SP!C34,))))))","v":0},{"$f":"IF($S$7=1,NL!D34,IF(cal!$S$7=2,EN!D34,IF(cal!$S$7=3,DE!D34,IF(cal!$S$7=4,FR!D34,IF(cal!$S$7=5,NR!D34,IF(cal!$S$7=6,SP!D34,))))))","v":0},{"$f":"IF($S$7=1,NL!E34,IF(cal!$S$7=2,EN!E34,IF(cal!$S$7=3,DE!E34,IF(cal!$S$7=4,FR!E34,IF(cal!$S$7=5,NR!E34,IF(cal!$S$7=6,SP!E34,))))))","v":0},{"$f":"IF($S$7=1,NL!F34,IF(cal!$S$7=2,EN!F34,IF(cal!$S$7=3,DE!F34,IF(cal!$S$7=4,FR!F34,IF(cal!$S$7=5,NR!F34,IF(cal!$S$7=6,SP!F34,))))))","v":0},{"$f":"IF($S$7=1,NL!G34,IF(cal!$S$7=2,EN!G34,IF(cal!$S$7=3,DE!G34,IF(cal!$S$7=4,FR!G34,IF(cal!$S$7=5,NR!G34,IF(cal!$S$7=6,SP!G34,))))))","v":0},{"$f":"IF($S$7=1,NL!H34,IF(cal!$S$7=2,EN!H34,IF(cal!$S$7=3,DE!H34,IF(cal!$S$7=4,FR!H34,IF(cal!$S$7=5,NR!H34,IF(cal!$S$7=6,SP!H34,))))))","v":0},{"$f":"IF($S$7=1,NL!I34,IF(cal!$S$7=2,EN!I34,IF(cal!$S$7=3,DE!I34,IF(cal!$S$7=4,FR!I34,IF(cal!$S$7=5,NR!I34,IF(cal!$S$7=6,SP!I34,))))))","v":0},{"$f":"IF($S$7=1,NL!J34,IF(cal!$S$7=2,EN!J34,IF(cal!$S$7=3,DE!J34,IF(cal!$S$7=4,FR!J34,IF(cal!$S$7=5,NR!J34,IF(cal!$S$7=6,SP!J34,))))))","v":0},{"$f":"IF($S$7=1,NL!K34,IF(cal!$S$7=2,EN!K34,IF(cal!$S$7=3,DE!K34,IF(cal!$S$7=4,FR!K34,IF(cal!$S$7=5,NR!K34,IF(cal!$S$7=6,SP!K34,))))))","v":0},{"$f":"IF($S$7=1,NL!L34,IF(cal!$S$7=2,EN!L34,IF(cal!$S$7=3,DE!L34,IF(cal!$S$7=4,FR!L34,IF(cal!$S$7=5,NR!L34,IF(cal!$S$7=6,SP!L34,))))))","v":0},{"$f":"IF($S$7=1,NL!M34,IF(cal!$S$7=2,EN!M34,IF(cal!$S$7=3,DE!M34,IF(cal!$S$7=4,FR!M34,IF(cal!$S$7=5,NR!M34,IF(cal!$S$7=6,SP!M34,))))))","v":0},{"$f":"IF($S$7=1,NL!N34,IF(cal!$S$7=2,EN!N34,IF(cal!$S$7=3,DE!N34,IF(cal!$S$7=4,FR!N34,IF(cal!$S$7=5,NR!N34,IF(cal!$S$7=6,SP!N34,))))))","v":0},{"$f":"IF($S$7=1,NL!O34,IF(cal!$S$7=2,EN!O34,IF(cal!$S$7=3,DE!O34,IF(cal!$S$7=4,FR!O34,IF(cal!$S$7=5,NR!O34,IF(cal!$S$7=6,SP!O34,))))))","v":0},{"$f":"IF($S$7=1,NL!P34,IF(cal!$S$7=2,EN!P34,IF(cal!$S$7=3,DE!P34,IF(cal!$S$7=4,FR!P34,IF(cal!$S$7=5,NR!P34,IF(cal!$S$7=6,SP!P34,))))))","v":0},null,null,"n-value",{"$nulls":3},"H",{"v":41,"d":"41.0"},"B",{"v":14,"d":"14.0"},"L",{"v":125,"d":"125.0"},null,null,"H",{"$f":"38*IF($W$4=1,1,IF($W$4=2,1/2.54))","v":38},"B",{"$f":"12*IF($W$4=1,1,IF($W$4=2,1/2.54))","v":12},"L",{"$f":"102*IF($W$4=1,1,IF($W$4=2,1/2.54))","v":102},null,"H",{"$f":"38*IF($W$4=1,1,IF($W$4=2,1/2.54))","v":38},"B",{"$f":"12*IF($W$4=1,1,IF($W$4=2,1/2.54))","v":12},"L",{"$f":"102*IF($W$4=1,1,IF($W$4=2,1/2.54))","v":102},null,"H",{"$f":"41*IF($W$4=1,1,IF($W$4=2,1/2.54))","v":41},"B",{"$f":"14*IF($W$4=1,1,IF($W$4=2,1/2.54))","v":14},"L",{"$f":"125*IF($W$4=1,1,IF($W$4=2,1/2.54))","v":125},null,"H",{"$f":"41*IF($W$4=1,1,IF($W$4=2,1/2.54))","v":41},"B",{"$f":"14*IF($W$4=1,1,IF($W$4=2,1/2.54))","v":14},"L",{"$f":"125*IF($W$4=1,1,IF($W$4=2,1/2.54))","v":125},null,"H",{"$f":"52*IF($W$4=1,1,IF($W$4=2,1/2.54))","v":52},"B",{"$f":"12*IF($W$4=1,1,IF($W$4=2,1/2.54))","v":12},"L",{"$f":"102*IF($W$4=1,1,IF($W$4=2,1/2.54))","v":102},null,"H",{"$f":"52*IF($W$4=1,1,IF($W$4=2,1/2.54))","v":52},"B",{"$f":"12*IF($W$4=1,1,IF($W$4=2,1/2.54))","v":12},"L",{"$f":"102*IF($W$4=1,1,IF($W$4=2,1/2.54))","v":102},null,"H",{"$f":"55*IF($W$4=1,1,IF($W$4=2,1/2.54))","v":55},"B",{"$f":"14*IF($W$4=1,1,IF($W$4=2,1/2.54))","v":14},"L",{"$f":"125*IF($W$4=1,1,IF($W$4=2,1/2.54))","v":125},null,"H",{"$f":"55*IF($W$4=1,1,IF($W$4=2,1/2.54))","v":55},"B",{"$f":"14*IF($W$4=1,1,IF($W$4=2,1/2.54))","v":14},"L",{"$f":"125*IF($W$4=1,1,IF($W$4=2,1/2.54))","v":125}]
[null,{"v":0.2,"d":"20%"},2,{"$f":"(($W$35*$C35^4+$W$36*$C35^3+$W$37*$C35^2+$W$38*$C35+$W$39)*((((Tv_heat-Tr_heat)/LN((Tv_heat-Tl_heat)/(Tr_heat-Tl_heat)))/((75-65)/LN((75-20)/(65-20))))^1))*$D$14*$AA$11","v":{"v":2998.699248841798,"d":"2999"}},{"$f":"ROUND(((D35/$D$14)/((Tv_heat-Tr_heat)*1.163))*$E$14,IF($W$4=1,0,IF($W$4=2,2)))","v":258},{"$f":"($X$36*(E35/$E$14)^$X$38)*$F$14","v":{"v":3.336914580405293,"d":"3.34"}},{"$f":"(($Y$35*$C35^4+$Y$36*$C35^3+$Y$37*$C35^2+$Y$38*$C35+$Y$39)*((((Tv_cool-Tr_cool)/LN((Tv_cool-Tl_cool)/(Tr_cool-Tl_cool)))/((16-18)/LN((16-27)/(18-27))))^S35))*$G$14*$AA$11","v":{"v":569.1758572106166,"d":"569"}},{"$f":"((G35/$G$14)/(IF((237.3*LN((RH*EXP(17.27*(Tl_cool/(Tl_cool+237.3))))))/(17.27-LN((RH*EXP(17.27*(Tl_cool/(Tl_cool+237.3))))))<((Tv_cool+Tr_cool)/2),1,IF(1/(1+((2258*((0.622/((p_atm/(1*611*EXP(17.27*(((Tv_cool+Tr_cool)/2)/(((Tv_cool+Tr_cool)/2)+237.3))))))-1)*1000-(0.622/((p_atm/(RH*611*EXP(17.27*(Tl_cool/(Tl_cool+237.3))))))-1)*1000))/(1005*(((Tv_cool+Tr_cool)/2)-Tl_cool))))*1.039+((-0.000729*$C35+0.001448)*(Tl_cool-((Tv_cool+Tr_cool)/2))+(0.016908*$C35-0.033574))*1.039>1,1,1/(1+((2258*((0.622/((p_atm/(1*611*EXP(17.27*(((Tv_cool+Tr_cool)/2)/(((Tv_cool+Tr_cool)/2)+237.3))))))-1)*1000-(0.622/((p_atm/(RH*611*EXP(17.27*(Tl_cool/(Tl_cool+237.3))))))-1)*1000))/(1005*(((Tv_cool+Tr_cool)/2)-Tl_cool))))*1.039+((-0.000729*$C35+0.001448)*(Tl_cool-((Tv_cool+Tr_cool)/2))+(0.016908*$C35-0.033574))*1.039))))*$H$14","v":{"v":694.1163892194924,"d":"694"}},{"$f":"ROUND(((H35/$H$14)/((Tr_cool-Tv_cool)*1.163))*$I$14,IF($W$4=1,0,IF($W$4=2,2)))","v":99},{"$f":"($Z$36*(I35/$I$14)^$Z$38)*$J$14","v":{"v":0.5785915375680388,"d":"0.58"}},{"$f":"L35-8","v":{"v":25.700000000000003,"d":"25.7"}},{"$f":"AA35","v":33.7},{"$f":"AB35","v":2.8},{"$f":"AC35*$N$14","v":173},{"$f":"(Tl_heat+(($D35/$G$14)/(1006*$N35*$K$14)))*(0.05*$C35+0.7)*$M$14+$O$14","v":{"v":57.21495479652375,"d":"57.2"}},{"$f":"(Tl_cool-((G35/$G$14)/(1006*N35*$K$14)))*$M$14+$O$14","v":{"v":15.221361297207142,"d":"15.2"}},null,null,{"v":1,"d":"1.000"},{"$nulls":3},{"$f":"IF($W$16=1,AE35,IF($W$16=2,AL35,IF($W$16=3,AS35,IF($W$16=4,AZ35,IF($W$16=5,BG35,IF($W$16=6,BN35,IF($W$16=7,BU35,IF($W$16=8,CB35))))))))","v":0},{"$f":"IF($W$16=1,AF35,IF($W$16=2,AM35,IF($W$16=3,AT35,IF($W$16=4,BA35,IF($W$16=5,BH35,IF($W$16=6,BO35,IF($W$16=7,BV35,IF($W$16=8,CC35))))))))","v":"a"},{"$f":"IF($W$16=1,AG35,IF($W$16=2,AN35,IF($W$16=3,AU35,IF($W$16=4,BB35,IF($W$16=5,BI35,IF($W$16=6,BP35,IF($W$16=7,BW35,IF($W$16=8,CD35))))))))","v":0},{"$f":"IF($W$16=1,AH35,IF($W$16=2,AO35,IF($W$16=3,AV35,IF($W$16=4,BC35,IF($W$16=5,BJ35,IF($W$16=6,BQ35,IF($W$16=7,BX35,IF($W$16=8,CE35))))))))","v":"a"},{"$f":"IF($W$16=1,AI35,IF($W$16=2,AP35,IF($W$16=3,AW35,IF($W$16=4,BD35,IF($W$16=5,BK35,IF($W$16=6,BR35,IF($W$16=7,BY35,IF($W$16=8,CF35))))))))","v":33.7},{"$f":"IF($W$16=1,AJ35,IF($W$16=2,AQ35,IF($W$16=3,AX35,IF($W$16=4,BE35,IF($W$16=5,BL35,IF($W$16=6,BS35,IF($W$16=7,BZ35,IF($W$16=8,CG35))))))))","v":2.8},{"$f":"IF($W$16=1,AK35,IF($W$16=2,AR35,IF($W$16=3,AY35,IF($W$16=4,BF35,IF($W$16=5,BM35,IF($W$16=6,BT35,IF($W$16=7,CA35,IF($W$16=8,CH35))))))))","v":173},"c",-2.955956017530086,"a",null,"a",{"v":34,"d":"34.0"},2.8,190,null,"a",null,"a",{"$f":"AI35","v":{"v":34,"d":"34.0"}},2.5,98,null,"a",null,"a",33.7,{"$f":"AJ35","v":2.8},173,null,"a",null,"a",{"$f":"AW35","v":33.7},{"$f":"AQ35","v":2.5},89,null,"a",0.11449437682638812,"a",34.2,2.8,200,-0.2240995466322409,"a",null,"a",{"$f":"BK35","v":34.2},2.7,139,null,"a",null,"a",33,{"$f":"BL35","v":2.8},182,null,"a",null,"a",{"$f":"BY35","v":33},{"$f":"BS35","v":2.7},126]
[null,{"v":0.4,"d":"40%"},4,{"$f":"(($W$35*$C36^4+$W$36*$C36^3+$W$37*$C36^2+$W$38*$C36+$W$39)*((((Tv_heat-Tr_heat)/LN((Tv_heat-Tl_heat)/(Tr_heat-Tl_heat)))/((75-65)/LN((75-20)/(65-20))))^1))*$D$14*$AA$11","v":{"v":3401.114332986619,"d":"3401"}},{"$f":"ROUND(((D36/$D$14)/((Tv_heat-Tr_heat)*1.163))*$E$14,IF($W$4=1,0,IF($W$4=2,2)))","v":292},{"$f":"($X$36*(E36/$E$14)^$X$38)*$F$14","v":{"v":4.18500164484905,"d":"4.19"}},{"$f":"(($Y$35*$C36^4+$Y$36*$C36^3+$Y$37*$C36^2+$Y$38*$C36+$Y$39)*((((Tv_cool-Tr_cool)/LN((Tv_cool-Tl_cool)/(Tr_cool-Tl_cool)))/((16-18)/LN((16-27)/(18-27))))^S36))*$G$14*$AA$11","v":{"v":622.7507831374619,"d":"623"}},{"$f":"((G36/$G$14)/(IF((237.3*LN((RH*EXP(17.27*(Tl_cool/(Tl_cool+237.3))))))/(17.27-LN((RH*EXP(17.27*(Tl_cool/(Tl_cool+237.3))))))<((Tv_cool+Tr_cool)/2),1,IF(1/(1+((2258*((0.622/((p_atm/(1*611*EXP(17.27*(((Tv_cool+Tr_cool)/2)/(((Tv_cool+Tr_cool)/2)+237.3))))))-1)*1000-(0.622/((p_atm/(RH*611*EXP(17.27*(Tl_cool/(Tl_cool+237.3))))))-1)*1000))/(1005*(((Tv_cool+Tr_cool)/2)-Tl_cool))))*1.039+((-0.000729*$C36+0.001448)*(Tl_cool-((Tv_cool+Tr_cool)/2))+(0.016908*$C36-0.033574))*1.039>1,1,1/(1+((2258*((0.622/((p_atm/(1*611*EXP(17.27*(((Tv_cool+Tr_cool)/2)/(((Tv_cool+Tr_cool)/2)+237.3))))))-1)*1000-(0.622/((p_atm/(RH*611*EXP(17.27*(Tl_cool/(Tl_cool+237.3))))))-1)*1000))/(1005*(((Tv_cool+Tr_cool)/2)-Tl_cool))))*1.039+((-0.000729*$C36+0.001448)*(Tl_cool-((Tv_cool+Tr_cool)/2))+(0.016908*$C36-0.033574))*1.039))))*$H$14","v":{"v":746.7686207391317,"d":"747"}},{"$f":"ROUND(((H36/$H$14)/((Tr_cool-Tv_cool)*1.163))*$I$14,IF($W$4=1,0,IF($W$4=2,2)))","v":107},{"$f":"($Z$36*(I36/$I$14)^$Z$38)*$J$14","v":{"v":0.6669747274765027,"d":"0.67"}},30.5,38.5,5.5,268,{"$f":"(Tl_heat+(($D36/$G$14)/(1006*$N36*$K$14)))*(0.05*$C36+0.7)*$M$14+$O$14","v":{"v":51.947436146240086,"d":"51.9"}},{"$f":"(Tl_cool-((G36/$G$14)/(1006*N36*$K$14)))*$M$14+$O$14","v":{"v":18.093507867066993,"d":"18.1"}},null,null,{"v":1,"d":"1.000"},{"$nulls":3},1.5118660666407935,1.2932915211001514E-4,0.18632215403912855,1.2932915211001514E-4,38.5,5.5,268,"d",78.37497386811825,1.2932915211001514E-4,-0.9895255552584159,{"$f":"AF36","v":1.2932915211001514E-4},39.4,5.5,295,1.907508602687446,{"$f":"AF36","v":1.2932915211001514E-4},0.17598150923924533,{"$f":"AH36","v":1.2932915211001514E-4},39.4,4.5,174,1.5118660666407935,{"$f":"AF36","v":1.2932915211001514E-4},0.18632215403912855,{"$f":"AO36","v":1.2932915211001514E-4},38.5,5.5,268,1.426761087082444,{"$f":"AF36","v":1.2932915211001514E-4},0.21151846586988798,{"$f":"AH36","v":1.2932915211001514E-4},38.5,4.5,158,-1.0193952578456988,2.7169905751214276E-4,-3.0580202694692744,{"$f":"BH36","v":2.7169905751214276E-4},{"v":40,"d":"40.0"},5.5,297,7.327370775443526,{"$f":"AF36","v":1.2932915211001514E-4},-0.22641939636044967,{"$f":"BJ36","v":2.7169905751214276E-4},{"v":40,"d":"40.0"},5.2,251,-1.7032731680051472,{"$f":"BH36","v":2.7169905751214276E-4},-0.3119332960261891,{"$f":"BJ36","v":2.7169905751214276E-4},38.8,5.5,270,1.1344894569539592,{"$f":"BO36","v":1.2932915211001514E-4},-0.3378093390745308,{"$f":"BQ36","v":2.7169905751214276E-4},38.8,5.2,228]
[null,{"v":0.6,"d":"60%"},6,{"$f":"(($W$35*$C37^4+$W$36*$C37^3+$W$37*$C37^2+$W$38*$C37+$W$39)*((((Tv_heat-Tr_heat)/LN((Tv_heat-Tl_heat)/(Tr_heat-Tl_heat)))/((75-65)/LN((75-20)/(65-20))))^1))*$D$14*$AA$11","v":{"v":3894.37903261701,"d":"3894"}},{"$f":"ROUND(((D37/$D$14)/((Tv_heat-Tr_heat)*1.163))*$E$14,IF($W$4=1,0,IF($W$4=2,2)))","v":335},{"v":5.380678553716439,"d":"5.38"},{"$f":"(($Y$35*$C37^4+$Y$36*$C37^3+$Y$37*$C37^2+$Y$38*$C37+$Y$39)*((((Tv_cool-Tr_cool)/LN((Tv_cool-Tl_cool)/(Tr_cool-Tl_cool)))/((16-18)/LN((16-27)/(18-27))))^S37))*$G$14*$AA$11","v":{"v":698.2752551836385,"d":"698"}},{"$f":"((G37/$G$14)/(IF((237.3*LN((RH*EXP(17.27*(Tl_cool/(Tl_cool+237.3))))))/(17.27-LN((RH*EXP(17.27*(Tl_cool/(Tl_cool+237.3))))))<((Tv_cool+Tr_cool)/2),1,IF(1/(1+((2258*((0.622/((p_atm/(1*611*EXP(17.27*(((Tv_cool+Tr_cool)/2)/(((Tv_cool+Tr_cool)/2)+237.3))))))-1)*1000-(0.622/((p_atm/(RH*611*EXP(17.27*(Tl_cool/(Tl_cool+237.3))))))-1)*1000))/(1005*(((Tv_cool+Tr_cool)/2)-Tl_cool))))*1.039+((-0.000729*$C37+0.001448)*(Tl_cool-((Tv_cool+Tr_cool)/2))+(0.016908*$C37-0.033574))*1.039>1,1,1/(1+((2258*((0.622/((p_atm/(1*611*EXP(17.27*(((Tv_cool+Tr_cool)/2)/(((Tv_cool+Tr_cool)/2)+237.3))))))-1)*1000-(0.622/((p_atm/(RH*611*EXP(17.27*(Tl_cool/(Tl_cool+237.3))))))-1)*1000))/(1005*(((Tv_cool+Tr_cool)/2)-Tl_cool))))*1.039+((-0.000729*$C37+0.001448)*(Tl_cool-((Tv_cool+Tr_cool)/2))+(0.016908*$C37-0.033574))*1.039))))*$H$14","v":{"v":823.5794854622305,"d":"824"}},{"$f":"ROUND(((H37/$H$14)/((Tr_cool-Tv_cool)*1.163))*$I$14,IF($W$4=1,0,IF($W$4=2,2)))","v":118},{"v":0.7977240241262115,"d":"0.80"},37.3,45.3,10.3,373,{"$f":"(Tl_heat+(($D37/$G$14)/(1006*$N37*$K$14)))*(0.05*$C37+0.7)*$M$14+$O$14","v":{"v":51.03183230080132,"d":"51.0"}},{"$f":"(Tl_cool-((G37/$G$14)/(1006*N37*$K$14)))*$M$14+$O$14","v":{"v":19.435888125636147,"d":"19.4"}},null,null,{"v":1,"d":"1.000"},{"$nulls":3},-6.7861908639932995,"b",-0.25188697625825573,"b",45.3,10.3,373,"e",-704.3094998770677,"b",21.042264468578555,"b",46.4,10.3,410,-17.746729246414905,"b",-1.0420209522650592,"b",46.4,{"v":9,"d":"9.0"},249,-6.7861908639932995,"b",-0.25188697625825573,"b",45.3,10.3,373,-10.163656045029517,"b",-2.312432305732183,"b",45.3,{"v":9,"d":"9.0"},227,10.781174684358943,"b",28.361806599292617,"b",{"v":47,"d":"47.0"},{"v":10,"d":"10.0"},396,-68.30313374616453,"b",3.8853075980776386,"b",{"v":47,"d":"47.0"},9.1,334,26.268050048769958,"b",5.571272065871202,"b",45.5,{"v":10,"d":"10.0"},360,-6.653151374936009,"b",6.50414727553332,"b",45.5,9.1,304]
[null,{"v":0.8,"d":"80%"},8,{"$f":"(($W$35*$C38^4+$W$36*$C38^3+$W$37*$C38^2+$W$38*$C38+$W$39)*((((Tv_heat-Tr_heat)/LN((Tv_heat-Tl_heat)/(Tr_heat-Tl_heat)))/((75-65)/LN((75-20)/(65-20))))^1))*$D$14*$AA$11","v":{"v":4551.062918931729,"d":"4551"}},{"$f":"ROUND(((D38/$D$14)/((Tv_heat-Tr_heat)*1.163))*$E$14,IF($W$4=1,0,IF($W$4=2,2)))","v":391},{"v":7.139101377160831,"d":"7.14"},{"$f":"(($Y$35*$C38^4+$Y$36*$C38^3+$Y$37*$C38^2+$Y$38*$C38+$Y$39)*((((Tv_cool-Tr_cool)/LN((Tv_cool-Tl_cool)/(Tr_cool-Tl_cool)))/((16-18)/LN((16-27)/(18-27))))^S38))*$G$14*$AA$11","v":{"v":808.1174092312896,"d":"808"}},{"$f":"((G38/$G$14)/(IF((237.3*LN((RH*EXP(17.27*(Tl_cool/(Tl_cool+237.3))))))/(17.27-LN((RH*EXP(17.27*(Tl_cool/(Tl_cool+237.3))))))<((Tv_cool+Tr_cool)/2),1,IF(1/(1+((2258*((0.622/((p_atm/(1*611*EXP(17.27*(((Tv_cool+Tr_cool)/2)/(((Tv_cool+Tr_cool)/2)+237.3))))))-1)*1000-(0.622/((p_atm/(RH*611*EXP(17.27*(Tl_cool/(Tl_cool+237.3))))))-1)*1000))/(1005*(((Tv_cool+Tr_cool)/2)-Tl_cool))))*1.039+((-0.000729*$C38+0.001448)*(Tl_cool-((Tv_cool+Tr_cool)/2))+(0.016908*$C38-0.033574))*1.039>1,1,1/(1+((2258*((0.622/((p_atm/(1*611*EXP(17.27*(((Tv_cool+Tr_cool)/2)/(((Tv_cool+Tr_cool)/2)+237.3))))))-1)*1000-(0.622/((p_atm/(RH*611*EXP(17.27*(Tl_cool/(Tl_cool+237.3))))))-1)*1000))/(1005*(((Tv_cool+Tr_cool)/2)-Tl_cool))))*1.039+((-0.000729*$C38+0.001448)*(Tl_cool-((Tv_cool+Tr_cool)/2))+(0.016908*$C38-0.033574))*1.039))))*$H$14","v":{"v":937.7295750033742,"d":"938"}},{"$f":"ROUND(((H38/$H$14)/((Tr_cool-Tv_cool)*1.163))*$I$14,IF($W$4=1,0,IF($W$4=2,2)))","v":134},{"v":1.0066381571087277,"d":"1.01"},{"v":43,"d":"43.0"},{"v":51,"d":"51.0"},18.5,466,{"$f":"(Tl_heat+(($D38/$G$14)/(1006*$N38*$K$14)))*(0.05*$C38+0.7)*$M$14+$O$14","v":{"v":53.9299060962134,"d":"53.9"}},{"$f":"(Tl_cool-((G38/$G$14)/(1006*N38*$K$14)))*$M$14+$O$14","v":{"v":19.84573694878792,"d":"19.8"}},null,null,{"v":1,"d":"1.000"},{"$nulls":3},199.5924373904281,1.829330158620641,15.664455358346679,1.829330158620641,51,18.5,466,"f",2760.940409170632,1.829330158620641,-83.40631658777811,{"$f":"AF38","v":1.829330158620641},52.2,18.5,512,249.0579921551496,{"$f":"AF38","v":1.829330158620641},25.701668848064646,{"$f":"AH38","v":1.829330158620641},52.2,{"v":17,"d":"17.0"},318,199.5924373904281,{"$f":"AF38","v":1.829330158620641},15.664455358346679,{"$f":"AO38","v":1.829330158620641},{"v":51,"d":"51.0"},18.5,466,191.91978998142477,{"$f":"AF38","v":1.829330158620641},34.90758347388724,{"$f":"AH38","v":1.829330158620641},{"v":51,"d":"51.0"},{"v":17,"d":"17.0"},289,534.8841978439976,1.815439154964933,-38.70731927403796,{"$f":"BH38","v":1.815439154964933},52.5,{"v":18,"d":"18.0"},500,411.59653619513693,{"$f":"AF38","v":1.829330158620641},30.989596772643303,{"$f":"BJ38","v":1.815439154964933},52.5,{"v":16,"d":"16.0"},432,398.10102592026755,{"$f":"BH38","v":1.815439154964933},34.97111415527813,{"$f":"BJ38","v":1.815439154964933},50.8,{"v":18,"d":"18.0"},455,140.53405061422265,{"$f":"BO38","v":1.829330158620641},9.261657387934209,{"$f":"BQ38","v":1.815439154964933},50.8,{"v":16,"d":"16.0"},393]
[null,{"v":1,"d":"100%"},10,{"$f":"(($W$35*$C39^4+$W$36*$C39^3+$W$37*$C39^2+$W$38*$C39+$W$39)*((((Tv_heat-Tr_heat)/LN((Tv_heat-Tl_heat)/(Tr_heat-Tl_heat)))/((75-65)/LN((75-20)/(65-20))))^1))*$D$14*$AA$11","v":{"v":5443.735563129534,"d":"5444"}},{"$f":"ROUND(((D39/$D$14)/((Tv_heat-Tr_heat)*1.163))*$E$14,IF($W$4=1,0,IF($W$4=2,2)))","v":468},{"v":9.9187672702891,"d":"9.92"},{"$f":"(($Y$35*$C39^4+$Y$36*$C39^3+$Y$37*$C39^2+$Y$38*$C39+$Y$39)*((((Tv_cool-Tr_cool)/LN((Tv_cool-Tl_cool)/(Tr_cool-Tl_cool)))/((16-18)/LN((16-27)/(18-27))))^S39))*$G$14*$AA$11","v":{"v":964.6453811625582,"d":"965"}},{"$f":"((G39/$G$14)/(IF((237.3*LN((RH*EXP(17.27*(Tl_cool/(Tl_cool+237.3))))))/(17.27-LN((RH*EXP(17.27*(Tl_cool/(Tl_cool+237.3))))))<((Tv_cool+Tr_cool)/2),1,IF(1/(1+((2258*((0.622/((p_atm/(1*611*EXP(17.27*(((Tv_cool+Tr_cool)/2)/(((Tv_cool+Tr_cool)/2)+237.3))))))-1)*1000-(0.622/((p_atm/(RH*611*EXP(17.27*(Tl_cool/(Tl_cool+237.3))))))-1)*1000))/(1005*(((Tv_cool+Tr_cool)/2)-Tl_cool))))*1.039+((-0.000729*$C39+0.001448)*(Tl_cool-((Tv_cool+Tr_cool)/2))+(0.016908*$C39-0.033574))*1.039>1,1,1/(1+((2258*((0.622/((p_atm/(1*611*EXP(17.27*(((Tv_cool+Tr_cool)/2)/(((Tv_cool+Tr_cool)/2)+237.3))))))-1)*1000-(0.622/((p_atm/(RH*611*EXP(17.27*(Tl_cool/(Tl_cool+237.3))))))-1)*1000))/(1005*(((Tv_cool+Tr_cool)/2)-Tl_cool))))*1.039+((-0.000729*$C39+0.001448)*(Tl_cool-((Tv_cool+Tr_cool)/2))+(0.016908*$C39-0.033574))*1.039))))*$H$14","v":{"v":1101.5610144486232,"d":"1102"}},{"$f":"ROUND(((H39/$H$14)/((Tr_cool-Tv_cool)*1.163))*$I$14,IF($W$4=1,0,IF($W$4=2,2)))","v":158},{"v":1.3607117905256103,"d":"1.36"},{"v":47,"d":"47.0"},{"v":55,"d":"55.0"},28.8,510,{"$f":"(Tl_heat+(($D39/$G$14)/(1006*$N39*$K$14)))*(0.05*$C39+0.7)*$M$14+$O$14","v":{"v":62.07028461878008,"d":"62.1"}},{"$f":"(Tl_cool-((G39/$G$14)/(1006*N39*$K$14)))*$M$14+$O$14","v":{"v":19.3781979930313,"d":"19.4"}},null,null,{"v":1,"d":"1.000"},{"$nulls":3},2614.564208983789,0,379.76208308685494,0,55,28.8,510,"g",-11.0814668782744,null,482.80744337778077,null,{"v":56,"d":"56.0"},28.8,560,2163.6048102319037,null,283.0273063153203,null,{"v":56,"d":"56.0"},28.8,420,2614.564208983789,null,379.76208308685494,null,{"v":55,"d":"55.0"},28.8,510,2025.6470693484523,null,228.6064063053341,null,{"v":55,"d":"55.0"},28.8,382,3546.902660077967,null,613.1687951782579,null,56.5,28.8,583,1396.965717339323,null,389.55522439955126,null,56.5,27.3,508,3621.175588849903,null,500.42990714727654,null,54.5,28.8,531,1716.3174609491957,null,414.9879357173651,null,54.5,27.3,462]
[null,{"$f":"IF($S$7=1,NL!B40,IF(cal!$S$7=2,EN!B40,IF(cal!$S$7=3,DE!B40,IF(cal!$S$7=4,FR!B40,IF(cal!$S$7=5,NR!B40,IF(cal!$S$7=6,SP!B40,IF(cal!$S$7=7,SW!B40,IF(cal!$S$7=8,TS!B40,IF(cal!$S$7=9,ExtraTaal1!B40,IF(cal!$S$7=10,ExtraTaal2!B40,IF(cal!$S$7=11,ExtraTaal3!B40,)))))))))))","v":"*Geluidsvermogen gemeten volgens ISO 3741:2010"},{"$nulls":13},{"$f":"'Briza 12'!P39","v":"v2021-04-26"},{"$nulls":6},"H",{"v":41,"d":"41.0"},"B",{"v":14,"d":"14.0"},"L",{"v":145,"d":"145.0"},null,null,"H",{"$f":"38*IF($W$4=1,1,IF($W$4=2,1/2.54))","v":38},"B",{"$f":"12*IF($W$4=1,1,IF($W$4=2,1/2.54))","v":12},"L",{"$f":"122*IF($W$4=1,1,IF($W$4=2,1/2.54))","v":122},null,"H",{"$f":"38*IF($W$4=1,1,IF($W$4=2,1/2.54))","v":38},"B",{"$f":"12*IF($W$4=1,1,IF($W$4=2,1/2.54))","v":12},"L",{"$f":"122*IF($W$4=1,1,IF($W$4=2,1/2.54))","v":122},null,"H",{"$f":"41*IF($W$4=1,1,IF($W$4=2,1/2.54))","v":41},"B",{"$f":"14*IF($W$4=1,1,IF($W$4=2,1/2.54))","v":14},"L",{"$f":"145*IF($W$4=1,1,IF($W$4=2,1/2.54))","v":145},null,"H",{"$f":"41*IF($W$4=1,1,IF($W$4=2,1/2.54))","v":41},"B",{"$f":"14*IF($W$4=1,1,IF($W$4=2,1/2.54))","v":14},"L",{"$f":"145*IF($W$4=1,1,IF($W$4=2,1/2.54))","v":145},null,"H",{"$f":"52*IF($W$4=1,1,IF($W$4=2,1/2.54))","v":52},"B",{"$f":"12*IF($W$4=1,1,IF($W$4=2,1/2.54))","v":12},"L",{"$f":"122*IF($W$4=1,1,IF($W$4=2,1/2.54))","v":122},null,"H",{"$f":"52*IF($W$4=1,1,IF($W$4=2,1/2.54))","v":52},"B",{"$f":"12*IF($W$4=1,1,IF($W$4=2,1/2.54))","v":12},"L",{"$f":"122*IF($W$4=1,1,IF($W$4=2,1/2.54))","v":122},null,"H",{"$f":"55*IF($W$4=1,1,IF($W$4=2,1/2.54))","v":55},"B",{"$f":"14*IF($W$4=1,1,IF($W$4=2,1/2.54))","v":14},"L",{"$f":"145*IF($W$4=1,1,IF($W$4=2,1/2.54))","v":145},null,"H",{"$f":"55*IF($W$4=1,1,IF($W$4=2,1/2.54))","v":55},"B",{"$f":"14*IF($W$4=1,1,IF($W$4=2,1/2.54))","v":14},"L",{"$f":"145*IF($W$4=1,1,IF($W$4=2,1/2.54))","v":145}]
[null,{"$f":"IF($S$7=1,NL!B41,IF(cal!$S$7=2,EN!B41,IF(cal!$S$7=3,DE!B41,IF(cal!$S$7=4,FR!B41,IF(cal!$S$7=5,NR!B41,IF(cal!$S$7=6,SP!B41,IF(cal!$S$7=7,SW!B41,IF(cal!$S$7=8,TS!B41,IF(cal!$S$7=9,ExtraTaal1!B41,IF(cal!$S$7=10,ExtraTaal2!B41,IF(cal!$S$7=11,ExtraTaal3!B41,)))))))))))","v":"**Geluidsdruk bij een aangenomen ruimtedemping van 8 dB(A)"}]

{"sheet":"NL","index":2,"n_rows":41,"n_cols":20,"rows_kept":41,"hidden":true,"merged":[[3,7,3,10],[4,7,4,10],[8,1,8,3],[8,6,8,9],[8,12,8,13],[9,1,9,3],[9,6,9,9],[10,1,10,3],[10,6,10,9],[15,1,15,13],[21,1,21,13],[27,1,27,13],[33,1,33,13]]}
[]
[]
[null,"Invulformulier"]
[{"$nulls":7},"Hydraulisch mengsel:",0,0,0]
[null,"Randvoorwaarden",{"$nulls":5},"Toestel - Ventilator - Uitvoering:",0,0,0]
[]
[null,"Temperaturen",{"$nulls":14},"Kopieer alle data"]
[null,"Verwarmen:",{"$nulls":4},"Koelen:",{"$nulls":9},"SI-eenheden"]
[null,{"$f":"\"Water aanvoer\"","v":"Water aanvoer"},null,null,{"$f":"cal!E9","v":75},null,{"$f":"B9","v":"Water aanvoer"},{"$nulls":3},{"$f":"cal!K9","v":8},null,"Eenheidsstelsel",{"$nulls":3},"Imperiale-eenheden"]
[null,{"$f":"\"Water retour\"","v":"Water retour"},null,null,{"$f":"cal!E10","v":65},null,{"$f":"B10","v":"Water retour"},{"$nulls":3},{"$f":"cal!K10","v":14}]
[null,{"$f":"\"Ruimte\"","v":"Ruimte"},null,null,{"$f":"cal!E11","v":20},null,{"$f":"B11","v":"Ruimte"},{"$nulls":3},{"$f":"cal!K11","v":25}]
[{"$nulls":6},"Relatieve vochtigheid",{"$nulls":3},{"$f":"cal!K12","v":{"v":0.5,"d":"50%"}}]
[]
[]
[null,"Snelheidsniveau","Stuurspanning [V]",{"$f":"CONCATENATE(\"Warmteafgifte  \",ROUND(E9,0),\"/\",ROUND(E10,0),\"/\",ROUND(E11,0),\" [\"&IF(UnitsNo=1,\"W\",IF(UnitsNo=2,\"Btu/h\"))&\"]\")","v":"Warmteafgifte  75/65/20 [W]"},{"$f":"\"Waterdebiet, verwarming [\"&IF(UnitsNo=1,\"l/h\",IF(UnitsNo=2,\"GPM\"))&\"]\"","v":"Waterdebiet, verwarming [l/h]"},{"$f":"\"Waterzijdig drukverlies [\"&IF(UnitsNo=1,\"kPa\",IF(UnitsNo=2,\"inH2O\"))&\"]\"","v":"Waterzijdig drukverlies [kPa]"},{"$f":"CONCATENATE(\"Voelb. Koelcapaciteit  \",ROUND(K9,0),\"/\",,ROUND(K10,0),\"/\",,ROUND(K11,0),\" [\"&IF(UnitsNo=1,\"W\",IF(UnitsNo=2,\"Btu/h\"))&\"]\")","v":"Voelb. Koelcapaciteit  8/14/25 [W]"},{"$f":"CONCATENATE(\"Tot. koelcapaciteit \",,ROUND(K9,0),\"/\",,ROUND(K10,0),\"/\",,ROUND(K11,0),\" [\"&IF(UnitsNo=1,\"W\",IF(UnitsNo=2,\"Btu/h\"))&\"]\")","v":"Tot. koelcapaciteit 8/14/25 [W]"},{"$f":"\"Waterdebiet, koeling [\"&IF(UnitsNo=1,\"l/h\",IF(UnitsNo=2,\"GPM\"))&\"]\"","v":"Waterdebiet, koeling [l/h]"},{"$f":"\"Waterzijdig drukverlies [\"&IF(UnitsNo=1,\"kPa\",IF(UnitsNo=2,\"inH2O\"))&\"]\"","v":"Waterzijdig drukverlies [kPa]"},"Geluidsdruk ** [dB(A)]","Geluidsvermogen * [dB(A)]","Opgenomen elektr. vermogen [W]",{"$f":"\"Luchtdebiet [\"&IF(UnitsNo=1,\"m³/h\",IF(UnitsNo=2,\"CFM\"))&\"]\"","v":"Luchtdebiet [m³/h]"},{"$f":"\"Uitblaastemp. verwarming  [\"&IF(UnitsNo=1,\"°C\",IF(UnitsNo=2,\"°F\"))&\"]\"","v":"Uitblaastemp. verwarming  [°C]"},{"$f":"\"Uitblaastemp. koeling  [\"&IF(UnitsNo=1,\"°C\",IF(UnitsNo=2,\"°F\"))&\"]\"","v":"Uitblaastemp. koeling  [°C]"}]
[null,{"$f":"cal!$X$1&\" \"&$T$16&\" \"&ROUND(cal!X22,1)&IF(UnitsNo=1,\" cm\",IF(UnitsNo=2,\" in\"))& \" \"&$T$17&\" \"&ROUND(cal!Z22,1)&IF(UnitsNo=1,\" cm\",IF(UnitsNo=2,\" in\"))&\" \"&$T$18&\" \"&ROUND(cal!AB22,1)&IF(UnitsNo=1,\" cm\",IF(UnitsNo=2,\" in\"))&\" (Type 1)\"","v":"Briza 12 hoogte 41 cm breedte 14 cm lengte 75 cm (Type 1)"},{"$nulls":15},"Temp.",null,"hoogte"]
[{"$nulls":17},"verw.!",null,"breedte"]
[{"$nulls":17},"koelen!",null,"lengte"]
[]
[]
[]
[null,{"$f":"cal!$X$1&\" \"&$T$16&\" \"&ROUND(cal!X28,1)&IF(UnitsNo=1,\" cm\",IF(UnitsNo=2,\" in\"))& \" \"&$T$17&\" \"&ROUND(cal!Z28,1)&IF(UnitsNo=1,\" cm\",IF(UnitsNo=2,\" in\"))&\" \"&$T$18&\" \"&ROUND(cal!AB28,1)&IF(UnitsNo=1,\" cm\",IF(UnitsNo=2,\" in\"))&\" (Type 2)\"","v":"Briza 12 hoogte 41 cm breedte 14 cm lengte 95 cm (Type 2)"}]
[]
[]
[]
[]
[]
[null,{"$f":"cal!$X$1&\" \"&$T$16&\" \"&ROUND(cal!X34,1)&IF(UnitsNo=1,\" cm\",IF(UnitsNo=2,\" in\"))& \" \"&$T$17&\" \"&ROUND(cal!Z34,1)&IF(UnitsNo=1,\" cm\",IF(UnitsNo=2,\" in\"))&\" \"&$T$18&\" \"&ROUND(cal!AB34,1)&IF(UnitsNo=1,\" cm\",IF(UnitsNo=2,\" in\"))&\" (Type 3)\"","v":"Briza 12 hoogte 41 cm breedte 14 cm lengte 125 cm (Type 3)"}]
[]
[]
[]
[]
[]
[null,{"$f":"cal!$X$1&\" \"&$T$16&\" \"&ROUND(cal!X40,1)&IF(UnitsNo=1,\" cm\",IF(UnitsNo=2,\" in\"))& \" \"&$T$17&\" \"&ROUND(cal!Z40,1)&IF(UnitsNo=1,\" cm\",IF(UnitsNo=2,\" in\"))&\" \"&$T$18&\" \"&ROUND(cal!AB40,1)&IF(UnitsNo=1,\" cm\",IF(UnitsNo=2,\" in\"))&\" (Type 4)\"","v":"Briza 12 hoogte 41 cm breedte 14 cm lengte 145 cm (Type 4)"}]
[]
[]
[]
[]
[]
[null,"*Geluidsvermogen gemeten volgens ISO 3741:2010",{"$nulls":11},{"$f":"cal!P40","v":"v2021-04-26"}]
[null,"**Geluidsdruk bij een aangenomen ruimtedemping van 8 dB(A)"]

{"sheet":"EN","index":3,"n_rows":41,"n_cols":20,"rows_kept":41,"hidden":true,"merged":[[3,7,3,10],[4,7,4,10],[8,1,8,3],[8,6,8,9],[8,12,8,13],[9,1,9,3],[9,6,9,9],[10,6,10,9],[15,1,15,13],[21,1,21,13],[27,1,27,13],[33,1,33,13]]}
[]
[]
[null,"Formulary"]
[{"$nulls":7},"Hydraulic mix:",0,0,0]
[null,"Conditions",{"$nulls":5},"Device - Ventilator - Utilization:",0,0,0]
[]
[null,"Temperatures",{"$nulls":14},"Copy all data"]
[null,"Heating:",{"$nulls":4},"Cooling:",{"$nulls":9},"SI-units"]
[null,"Supply water",null,null,{"$f":"cal!E9","v":75},null,{"$f":"B9","v":"Supply water"},{"$nulls":3},{"$f":"cal!K9","v":8},null,"Unit conversion",{"$nulls":3},"Imperial-units"]
[null,"Return water",null,null,{"$f":"cal!E10","v":65},null,{"$f":"B10","v":"Return water"},{"$nulls":3},{"$f":"cal!K10","v":14}]
[null,"Entering air",null,null,{"$f":"cal!E11","v":20},null,{"$f":"B11","v":"Entering air"},{"$nulls":3},{"$f":"cal!K11","v":25}]
[{"$nulls":6},"Relative humidity",{"$nulls":3},{"$f":"cal!K12","v":{"v":0.5,"d":"50%"}}]
[]
[]
[null,"Speed level","Control voltage [V]",{"$f":"CONCATENATE(\"Heat output  \",ROUND(E9,0),\"/\",ROUND(E10,0),\"/\",ROUND(E11,0),\" [\"&IF(cal!$W$4=1,\"W\",IF(cal!$W$4=2,\"Btu/h\"))&\"]\")","v":"Heat output  75/65/20 [W]"},{"$f":"\"Water flowrate, heating [\"&IF(cal!$W$4=1,\"l/h\",IF(cal!$W$4=2,\"GPM\"))&\"]\"","v":"Water flowrate, heating [l/h]"},{"$f":"\"Watersided pressure loss [\"&IF(cal!$W$4=1,\"kPa\",IF(cal!$W$4=2,\"inH2O\"))&\"]\"","v":"Watersided pressure loss [kPa]"},{"$f":"CONCATENATE(\"Sens. cooling capacity  \",ROUND(K9,0),\"/\",ROUND(K10,0),\"/\",ROUND(K11,0),\" [\"&IF(cal!$W$4=1,\"W\",IF(cal!$W$4=2,\"Btu/h\"))&\"]\")","v":"Sens. cooling capacity  8/14/25 [W]"},{"$f":"CONCATENATE(\"Tot. cooling capacity \",ROUND(K9,0),\"/\",ROUND(K10,0),\"/\",ROUND(K11,0),\" [\"&IF(cal!$W$4=1,\"W\",IF(cal!$W$4=2,\"Btu/h\"))&\"]\")","v":"Tot. cooling capacity 8/14/25 [W]"},{"$f":"\"Water flowrate, cooling [\"&IF(cal!$W$4=1,\"l/h\",IF(cal!$W$4=2,\"GPM\"))&\"]\"","v":"Water flowrate, cooling [l/h]"},{"$f":"\"Watersided pressure loss [\"&IF(cal!$W$4=1,\"kPa\",IF(cal!$W$4=2,\"inH2O\"))&\"]\"","v":"Watersided pressure loss [kPa]"},"Sound pressure ** [dB(A)]","Sound power * [dB(A)]","Electrical power [W]",{"$f":"\"Air flowrate [\"&IF(cal!$W$4=1,\"m³/h\",IF(cal!$W$4=2,\"CFM\"))&\"]\"","v":"Air flowrate [m³/h]"},{"$f":"\"Air exhaust temp. heating  [\"&IF(cal!$W$4=1,\"°C\",IF(cal!$W$4=2,\"°F\"))&\"]\"","v":"Air exhaust temp. heating  [°C]"},{"$f":"\"Air exhaust temp. cooling  [\"&IF(cal!$W$4=1,\"°C\",IF(cal!$W$4=2,\"°F\"))&\"]\"","v":"Air exhaust temp. cooling  [°C]"}]
[null,{"$f":"cal!$X$1&\" \"&$T$16&\" \"&ROUND(cal!X22,1)&IF(UnitsNo=1,\" cm\",IF(UnitsNo=2,\" in\"))& \" \"&$T$17&\" \"&ROUND(cal!Z22,1)&IF(UnitsNo=1,\" cm\",IF(UnitsNo=2,\" in\"))&\" \"&$T$18&\" \"&ROUND(cal!AB22,1)&IF(UnitsNo=1,\" cm\",IF(UnitsNo=2,\" in\"))&\" (Type 1)\"","v":"Briza 12 height 41 cm width 14 cm length 75 cm (Type 1)"},{"$nulls":15},"Temp.",null,"height"]
[{"$nulls":17},"heating!",null,"width"]
[{"$nulls":17},"cooling!",null,"length"]
[]
[]
[]
[null,{"$f":"cal!$X$1&\" \"&$T$16&\" \"&ROUND(cal!X28,1)&IF(UnitsNo=1,\" cm\",IF(UnitsNo=2,\" in\"))& \" \"&$T$17&\" \"&ROUND(cal!Z28,1)&IF(UnitsNo=1,\" cm\",IF(UnitsNo=2,\" in\"))&\" \"&$T$18&\" \"&ROUND(cal!AB28,1)&IF(UnitsNo=1,\" cm\",IF(UnitsNo=2,\" in\"))&\" (Type 2)\"","v":"Briza 12 height 41 cm width 14 cm length 95 cm (Type 2)"}]
[]
[]
[]
[]
[]
[null,{"$f":"cal!$X$1&\" \"&$T$16&\" \"&ROUND(cal!X34,1)&IF(UnitsNo=1,\" cm\",IF(UnitsNo=2,\" in\"))& \" \"&$T$17&\" \"&ROUND(cal!Z34,1)&IF(UnitsNo=1,\" cm\",IF(UnitsNo=2,\" in\"))&\" \"&$T$18&\" \"&ROUND(cal!AB34,1)&IF(UnitsNo=1,\" cm\",IF(UnitsNo=2,\" in\"))&\" (Type 3)\"","v":"Briza 12 height 41 cm width 14 cm length 125 cm (Type 3)"}]
[]
[]
[]
[]
[]
[null,{"$f":"cal!$X$1&\" \"&$T$16&\" \"&ROUND(cal!X40,1)&IF(UnitsNo=1,\" cm\",IF(UnitsNo=2,\" in\"))& \" \"&$T$17&\" \"&ROUND(cal!Z40,1)&IF(UnitsNo=1,\" cm\",IF(UnitsNo=2,\" in\"))&\" \"&$T$18&\" \"&ROUND(cal!AB40,1)&IF(UnitsNo=1,\" cm\",IF(UnitsNo=2,\" in\"))&\" (Type 4)\"","v":"Briza 12 height 41 cm width 14 cm length 145 cm (Type 4)"}]
[]
[]
[]
[]
[]
[null,"*Sound power according to ISO 3741:2010",{"$nulls":11},{"$f":"cal!P40","v":"v2021-04-26"}]
[null,"**Sound pressure with an assumed room damping of 8dB(A)"]

{"sheet":"DE","index":4,"n_rows":41,"n_cols":20,"rows_kept":41,"hidden":true,"merged":[[3,7,3,10],[4,7,4,10],[8,1,8,3],[8,6,8,9],[8,12,8,13],[9,1,9,3],[9,6,9,9],[10,1,10,3],[10,6,10,9],[15,1,15,13],[21,1,21,13],[27,1,27,13],[33,1,33,13]]}
[]
[]
[null,"Eingabefelder"]
[{"$nulls":7},"Hydraulikgemisch:"]
[null,"Auslegungsrandbedingungen",{"$nulls":5},"Gerät - Lüfter - Ausfürhung:",0,0,0]
[]
[null,"Temperaturen",{"$nulls":14},"Kopieren Sie alle daten"]
[null,"Heizen:",{"$nulls":4},"Kühlen:",{"$nulls":9},"SI-einheiten"]
[null,{"$f":"\"Vorlauf wasser\"","v":"Vorlauf wasser"},null,null,{"$f":"cal!E9","v":75},null,{"$f":"B9","v":"Vorlauf wasser"},{"$nulls":3},{"$f":"cal!K9","v":8},null,"Einheiten",{"$nulls":3},"Imperiale-einheiten"]
[null,{"$f":"\"Rücklauf wasser\"","v":"Rücklauf wasser"},null,null,{"$f":"cal!E10","v":65},null,{"$f":"B10","v":"Rücklauf wasser"},{"$nulls":3},{"$f":"cal!K10","v":14}]
[null,{"$f":"\"Raum\"","v":"Raum"},null,null,{"$f":"cal!E11","v":20},null,{"$f":"B11","v":"Raum"},{"$nulls":3},{"$f":"cal!K11","v":25}]
[{"$nulls":6},"Relative Luftfeuchtigkeit",{"$nulls":3},{"$f":"cal!K12","v":{"v":0.5,"d":"50%"}}]
[]
[]
[null,"Drehzahlstufe","Regelspannung [V]",{"$f":"CONCATENATE(\"Wärmeleistung  \",ROUND(E9,0),\"/\",ROUND(E10,0),\"/\",ROUND(E11,0),\" [\"&IF(cal!$W$4=1,\"W\",IF(cal!$W$4=2,\"Btu/h\"))&\"]\")","v":"Wärmeleistung  75/65/20 [W]"},{"$f":"\"Heizmittelstrom [\"&IF(cal!$W$4=1,\"l/h\",IF(cal!$W$4=2,\"GPM\"))&\"]\"","v":"Heizmittelstrom [l/h]"},{"$f":"\"zug. wassers. Druckverlust [\"&IF(cal!$W$4=1,\"kPa\",IF(cal!$W$4=2,\"inH2O\"))&\"]\"","v":"zug. wassers. Druckverlust [kPa]"},{"$f":"CONCATENATE(\"Sens. Kälteleistung  \",ROUND(K9,0),\"/\",ROUND(K10,0),\"/\",ROUND(K11,0),\" [\"&IF(cal!$W$4=1,\"W\",IF(cal!$W$4=2,\"Btu/h\"))&\"]\")","v":"Sens. Kälteleistung  8/14/25 [W]"},{"$f":"CONCATENATE(\"Tot. Kälteleistung \",ROUND(K9,0),\"/\",ROUND(K10,0),\"/\",ROUND(K11,0),\" [\"&IF(cal!$W$4=1,\"W\",IF(cal!$W$4=2,\"Btu/h\"))&\"]\")","v":"Tot. Kälteleistung 8/14/25 [W]"},{"$f":"\"Kühlmittelstrom [\"&IF(cal!$W$4=1,\"l/h\",IF(cal!$W$4=2,\"GPM\"))&\"]\"","v":"Kühlmittelstrom [l/h]"},{"$f":"\"zug. wassers. Druckverlust [\"&IF(cal!$W$4=1,\"kPa\",IF(cal!$W$4=2,\"inH2O\"))&\"]\"","v":"zug. wassers. Druckverlust [kPa]"},"Schalldruckpegel ** [dB(A)]","Schallleistungspegel * [dB(A)]","Leistungsaufnahme [W]",{"$f":"\"Luftvolumenstrom [\"&IF(cal!$W$4=1,\"m³/h\",IF(cal!$W$4=2,\"CFM\"))&\"]\"","v":"Luftvolumenstrom [m³/h]"},{"$f":"\"Luftaustrittstemp. Heizung  [\"&IF(cal!$W$4=1,\"°C\",IF(cal!$W$4=2,\"°F\"))&\"]\"","v":"Luftaustrittstemp. Heizung  [°C]"},{"$f":"\"Luftaustrittstemp. Kühlung  [\"&IF(cal!$W$4=1,\"°C\",IF(cal!$W$4=2,\"°F\"))&\"]\"","v":"Luftaustrittstemp. Kühlung  [°C]"}]
[null,{"$f":"cal!$X$1&\" \"&$T$16&\" \"&ROUND(cal!X22,1)&IF(UnitsNo=1,\" cm\",IF(UnitsNo=2,\" in\"))& \" \"&$T$17&\" \"&ROUND(cal!Z22,1)&IF(UnitsNo=1,\" cm\",IF(UnitsNo=2,\" in\"))&\" \"&$T$18&\" \"&ROUND(cal!AB22,1)&IF(UnitsNo=1,\" cm\",IF(UnitsNo=2,\" in\"))&\" (Type 1)\"","v":"Briza 12 höhe 41 cm breite 14 cm länge 75 cm (Type 1)"},{"$nulls":15},"Temp.",null,"höhe"]
[{"$nulls":17},"heizen!",null,"breite"]
[{"$nulls":17},"kühlen!",null,"länge"]
[]
[]
[]
[null,{"$f":"cal!$X$1&\" \"&$T$16&\" \"&ROUND(cal!X28,1)&IF(UnitsNo=1,\" cm\",IF(UnitsNo=2,\" in\"))& \" \"&$T$17&\" \"&ROUND(cal!Z28,1)&IF(UnitsNo=1,\" cm\",IF(UnitsNo=2,\" in\"))&\" \"&$T$18&\" \"&ROUND(cal!AB28,1)&IF(UnitsNo=1,\" cm\",IF(UnitsNo=2,\" in\"))&\" (Type 2)\"","v":"Briza 12 höhe 41 cm breite 14 cm länge 95 cm (Type 2)"}]
[]
[]
[]
[]
[]
[null,{"$f":"cal!$X$1&\" \"&$T$16&\" \"&ROUND(cal!X34,1)&IF(UnitsNo=1,\" cm\",IF(UnitsNo=2,\" in\"))& \" \"&$T$17&\" \"&ROUND(cal!Z34,1)&IF(UnitsNo=1,\" cm\",IF(UnitsNo=2,\" in\"))&\" \"&$T$18&\" \"&ROUND(cal!AB34,1)&IF(UnitsNo=1,\" cm\",IF(UnitsNo=2,\" in\"))&\" (Type 3)\"","v":"Briza 12 höhe 41 cm breite 14 cm länge 125 cm (Type 3)"}]
[]
[]
[]
[]
[]
[null,{"$f":"cal!$X$1&\" \"&$T$16&\" \"&ROUND(cal!X40,1)&IF(UnitsNo=1,\" cm\",IF(UnitsNo=2,\" in\"))& \" \"&$T$17&\" \"&ROUND(cal!Z40,1)&IF(UnitsNo=1,\" cm\",IF(UnitsNo=2,\" in\"))&\" \"&$T$18&\" \"&ROUND(cal!AB40,1)&IF(UnitsNo=1,\" cm\",IF(UnitsNo=2,\" in\"))&\" (Type 4)\"","v":"Briza 12 höhe 41 cm breite 14 cm länge 145 cm (Type 4)"}]
[]
[]
[]
[]
[]
[null,"*Schallleistungspegel nach ISO 3741:2010"]
[null,"**Schalldruckpegel bei angenommener Raumdämpfung von 8dB(A)"]

{"sheet":"FR","index":5,"n_rows":41,"n_cols":20,"rows_kept":41,"hidden":true,"merged":[[3,7,3,10],[4,7,4,10],[8,1,8,3],[8,6,8,9],[8,12,8,13],[9,1,9,3],[9,6,9,9],[10,1,10,3],[10,6,10,9],[15,1,15,13],[21,1,21,13],[27,1,27,13],[33,1,33,13]]}
[]
[]
[null,"Formulaire"]
[{"$nulls":7},"Mélange hydraulique:"]
[null,"Conditions",{"$nulls":5},"Appareil - Ventilateur - Version:",0,0,0]
[]
[null,"Températures",{"$nulls":14},"Copier toutes des données"]
[null,"Chauffer:",{"$nulls":4},"Refroidir:",{"$nulls":9},"Unités-SI"]
[null,{"$f":"\"Entrée de l'eau\"","v":"Entrée de l'eau"},null,null,{"$f":"cal!E9","v":75},null,{"$f":"B9","v":"Entrée de l'eau"},{"$nulls":3},{"$f":"cal!K9","v":8},null,"Système unitaire",{"$nulls":3},"Unités-Impériales"]
[null,{"$f":"\"Retour de l'eau\"","v":"Retour de l'eau"},null,null,{"$f":"cal!E10","v":65},null,{"$f":"B10","v":"Retour de l'eau"},{"$nulls":3},{"$f":"cal!K10","v":14}]
[null,{"$f":"\"Ambiante\"","v":"Ambiante"},null,null,{"$f":"cal!E11","v":20},null,{"$f":"B11","v":"Ambiante"},{"$nulls":3},{"$f":"cal!K11","v":25}]
[{"$nulls":6},"Humidité relative",{"$nulls":3},{"$f":"cal!K12","v":{"v":0.5,"d":"50%"}}]
[]
[]
[null,"Niveau de vitesse","Voltage [V]",{"$f":"CONCATENATE(\"Puissance de cha.  \",ROUND(E9,0),\"/\",ROUND(E10,0),\"/\",ROUND(E11,0),\" [\"&IF(cal!$W$4=1,\"W\",IF(cal!$W$4=2,\"Btu/h\"))&\"]\")","v":"Puissance de cha.  75/65/20 [W]"},{"$f":"\"Débit d'eau, chauffer [\"&IF(cal!$W$4=1,\"l/h\",IF(cal!$W$4=2,\"GPM\"))&\"]\"","v":"Débit d'eau, chauffer [l/h]"},{"$f":"\"Perte de charge [\"&IF(cal!$W$4=1,\"kPa\",IF(cal!$W$4=2,\"inH2O\"))&\"]\"","v":"Perte de charge [kPa]"},{"$f":"CONCATENATE(\"Puissance sens. de refr.  \",ROUND(K9,0),\"/\",ROUND(K10,0),\"/\",ROUND(K11,0),\" [\"&IF(cal!$W$4=1,\"W\",IF(cal!$W$4=2,\"Btu/h\"))&\"]\")","v":"Puissance sens. de refr.  8/14/25 [W]"},{"$f":"CONCATENATE(\"Puissance tot. de refr. \",ROUND(K9,0),\"/\",ROUND(K10,0),\"/\",ROUND(K11,0),\" [\"&IF(cal!$W$4=1,\"W\",IF(cal!$W$4=2,\"Btu/h\"))&\"]\")","v":"Puissance tot. de refr. 8/14/25 [W]"},{"$f":"\"Débit d'eau, refroidir [\"&IF(cal!$W$4=1,\"l/h\",IF(cal!$W$4=2,\"GPM\"))&\"]\"","v":"Débit d'eau, refroidir [l/h]"},{"$f":"\"Perte de charge [\"&IF(cal!$W$4=1,\"kPa\",IF(cal!$W$4=2,\"inH2O\"))&\"]\"","v":"Perte de charge [kPa]"},"Pression sonore ** [dB(A)]","Puissance sonore * [dB(A)]","Puissance absorbée [W]",{"$f":"\"Débit d'air [\"&IF(cal!$W$4=1,\"m³/h\",IF(cal!$W$4=2,\"CFM\"))&\"]\"","v":"Débit d'air [m³/h]"},{"$f":"\"Temp. de la sortie d'air cha.  [\"&IF(cal!$W$4=1,\"°C\",IF(cal!$W$4=2,\"°F\"))&\"]\"","v":"Temp. de la sortie d'air cha.  [°C]"},{"$f":"\"Temp. de la sortie d'air refr.  [\"&IF(cal!$W$4=1,\"°C\",IF(cal!$W$4=2,\"°F\"))&\"]\"","v":"Temp. de la sortie d'air refr.  [°C]"}]
[null,{"$f":"cal!$X$1&\" \"&$T$16&\" \"&ROUND(cal!X22,1)&IF(UnitsNo=1,\" cm\",IF(UnitsNo=2,\" in\"))& \" \"&$T$17&\" \"&ROUND(cal!Z22,1)&IF(UnitsNo=1,\" cm\",IF(UnitsNo=2,\" in\"))&\" \"&$T$18&\" \"&ROUND(cal!AB22,1)&IF(UnitsNo=1,\" cm\",IF(UnitsNo=2,\" in\"))&\" (Type 1)\"","v":"Briza 12 hauteur 41 cm largeur 14 cm longueur 75 cm (Type 1)"},{"$nulls":15},"Temp.",null,"hauteur"]
[{"$nulls":17},"chauf.!",null,"largeur"]
[{"$nulls":17},"refr.!",null,"longueur"]
[]
[]
[]
[null,{"$f":"cal!$X$1&\" \"&$T$16&\" \"&ROUND(cal!X28,1)&IF(UnitsNo=1,\" cm\",IF(UnitsNo=2,\" in\"))& \" \"&$T$17&\" \"&ROUND(cal!Z28,1)&IF(UnitsNo=1,\" cm\",IF(UnitsNo=2,\" in\"))&\" \"&$T$18&\" \"&ROUND(cal!AB28,1)&IF(UnitsNo=1,\" cm\",IF(UnitsNo=2,\" in\"))&\" (Type 2)\"","v":"Briza 12 hauteur 41 cm largeur 14 cm longueur 95 cm (Type 2)"}]
[]
[]
[]
[]
[]
[null,{"$f":"cal!$X$1&\" \"&$T$16&\" \"&ROUND(cal!X34,1)&IF(UnitsNo=1,\" cm\",IF(UnitsNo=2,\" in\"))& \" \"&$T$17&\" \"&ROUND(cal!Z34,1)&IF(UnitsNo=1,\" cm\",IF(UnitsNo=2,\" in\"))&\" \"&$T$18&\" \"&ROUND(cal!AB34,1)&IF(UnitsNo=1,\" cm\",IF(UnitsNo=2,\" in\"))&\" (Type 3)\"","v":"Briza 12 hauteur 41 cm largeur 14 cm longueur 125 cm (Type 3)"}]
[]
[]
[]
[]
[]
[null,{"$f":"cal!$X$1&\" \"&$T$16&\" \"&ROUND(cal!X40,1)&IF(UnitsNo=1,\" cm\",IF(UnitsNo=2,\" in\"))& \" \"&$T$17&\" \"&ROUND(cal!Z40,1)&IF(UnitsNo=1,\" cm\",IF(UnitsNo=2,\" in\"))&\" \"&$T$18&\" \"&ROUND(cal!AB40,1)&IF(UnitsNo=1,\" cm\",IF(UnitsNo=2,\" in\"))&\" (Type 4)\"","v":"Briza 12 hauteur 41 cm largeur 14 cm longueur 145 cm (Type 4)"}]
[]
[]
[]
[]
[]
[null,"*Puissance sonore testé selon ISO 3741:2010",{"$nulls":11},{"$f":"cal!P40","v":"v2021-04-26"}]
[null,"**Pression sonore avec une atténuation ambiante du 8dB(A)"]

{"sheet":"NR","index":6,"n_rows":41,"n_cols":20,"rows_kept":41,"hidden":true,"merged":[[3,7,3,10],[4,7,4,10],[8,1,8,3],[8,6,8,9],[8,12,8,13],[9,1,9,3],[9,6,9,9],[10,1,10,3],[10,6,10,9],[11,6,11,9],[15,1,15,13],[21,1,21,13],[27,1,27,13],[33,1,33,13]]}
[]
[]
[null,"Modell"]
[{"$nulls":7},"Væske blanding:",0,0,0]
[null,"Conditions",{"$nulls":5},"Modell:",0,0,0]
[]
[null,"Temperaturer",{"$nulls":14},"Kopier alle data"]
[null,"Varme:",{"$nulls":4},"Kjøling:",{"$nulls":9},"SI-enheter"]
[null,"Tur vann",0,0,{"$f":"cal!E9","v":75},null,{"$f":"B9","v":"Tur vann"},{"$nulls":3},{"$f":"cal!K9","v":8},null,"Enhetssystem",{"$nulls":3},"Imperiale-enheter"]
[null,"Retur vann",0,0,{"$f":"cal!E10","v":65},null,{"$f":"B10","v":"Retur vann"},{"$nulls":3},{"$f":"cal!K10","v":14}]
[null,"Rom",0,0,{"$f":"cal!E11","v":20},null,{"$f":"B11","v":"Rom"},{"$nulls":3},{"$f":"cal!K11","v":25}]
[{"$nulls":6},"Relativ fuktighet",{"$nulls":3},{"$f":"cal!K12","v":{"v":0.5,"d":"50%"}}]
[]
[]
[null,"Hastighet","Styresignal [V]",{"$f":"CONCATENATE(\"Varme effekt \",ROUND(E9,0),\"/\",ROUND(E10,0),\"/\",ROUND(E11,0),\" [\"&IF(cal!$W$4=1,\"W\",IF(cal!$W$4=2,\"Btu/h\"))&\"]\")","v":"Varme effekt 75/65/20 [W]"},{"$f":"\"Vannmengde, varme [\"&IF(cal!$W$4=1,\"l/h\",IF(cal!$W$4=2,\"GPM\"))&\"]\"","v":"Vannmengde, varme [l/h]"},{"$f":"\"Trykktap [\"&IF(cal!$W$4=1,\"kPa\",IF(cal!$W$4=2,\"ftH2O\"))&\"]\"","v":"Trykktap [kPa]"},{"$f":"CONCATENATE(\"Sens. Kjøling effekt * \",ROUND(K9,0),\"/\",ROUND(K10,0),\"/\",ROUND(K11,0),\" [\"&IF(cal!$W$4=1,\"W\",IF(cal!$W$4=2,\"Btu/h\"))&\"]\")","v":"Sens. Kjøling effekt * 8/14/25 [W]"},{"$f":"CONCATENATE(\"Tot. Kjøle effekt \",ROUND(K9,0),\"/\",ROUND(K10,0),\"/\",ROUND(K11,0),\" [\"&IF(cal!$W$4=1,\"W\",IF(cal!$W$4=2,\"Btu/h\"))&\"]\")","v":"Tot. Kjøle effekt 8/14/25 [W]"},{"$f":"\"Vannmengde, kjøling [\"&IF(cal!$W$4=1,\"l/h\",IF(cal!$W$4=2,\"GPM\"))&\"]\"","v":"Vannmengde, kjøling [l/h]"},{"$f":"F15","v":"Trykktap [kPa]"},"Lydtrykk ** [dB(A)]","Lydeffekt * [dB(A)]","Elektrisk effekt [W]",{"$f":"\"Luftmengde [\"&IF(cal!$W$4=1,\"m³/h\",IF(cal!$W$4=2,\"CFM\"))&\"]\"","v":"Luftmengde [m³/h]"},{"$f":"\"Uitblaastemp. verwarming  [\"&IF(cal!$W$4=1,\"°C\",IF(cal!$W$4=2,\"°F\"))&\"]\"","v":"Uitblaastemp. verwarming  [°C]"},{"$f":"\"Uitblaastemp. koeling  [\"&IF(cal!$W$4=1,\"°C\",IF(cal!$W$4=2,\"°F\"))&\"]\"","v":"Uitblaastemp. koeling  [°C]"}]
[null,{"$f":"cal!$X$1&\" \"&$T$16&\" \"&ROUND(cal!X22,1)&IF(UnitsNo=1,\" cm\",IF(UnitsNo=2,\" in\"))& \" \"&$T$17&\" \"&ROUND(cal!Z22,1)&IF(UnitsNo=1,\" cm\",IF(UnitsNo=2,\" in\"))&\" \"&$T$18&\" \"&ROUND(cal!AB22,1)&IF(UnitsNo=1,\" cm\",IF(UnitsNo=2,\" in\"))&\" (Type 1)\"","v":"Briza 12 høyde 41 cm bredde 14 cm lengde 75 cm (Type 1)"},{"$nulls":15},"Temp.",null,"høyde"]
[{"$nulls":17},"varme!",null,"bredde"]
[{"$nulls":17},"kjøling!",null,"lengde"]
[]
[]
[]
[null,{"$f":"cal!$X$1&\" \"&$T$16&\" \"&ROUND(cal!X28,1)&IF(UnitsNo=1,\" cm\",IF(UnitsNo=2,\" in\"))& \" \"&$T$17&\" \"&ROUND(cal!Z28,1)&IF(UnitsNo=1,\" cm\",IF(UnitsNo=2,\" in\"))&\" \"&$T$18&\" \"&ROUND(cal!AB28,1)&IF(UnitsNo=1,\" cm\",IF(UnitsNo=2,\" in\"))&\" (Type 2)\"","v":"Briza 12 høyde 41 cm bredde 14 cm lengde 95 cm (Type 2)"}]
[]
[]
[]
[]
[]
[null,{"$f":"cal!$X$1&\" \"&$T$16&\" \"&ROUND(cal!X34,1)&IF(UnitsNo=1,\" cm\",IF(UnitsNo=2,\" in\"))& \" \"&$T$17&\" \"&ROUND(cal!Z34,1)&IF(UnitsNo=1,\" cm\",IF(UnitsNo=2,\" in\"))&\" \"&$T$18&\" \"&ROUND(cal!AB34,1)&IF(UnitsNo=1,\" cm\",IF(UnitsNo=2,\" in\"))&\" (Type 3)\"","v":"Briza 12 høyde 41 cm bredde 14 cm lengde 125 cm (Type 3)"}]
[]
[]
[]
[]
[]
[null,{"$f":"cal!$X$1&\" \"&$T$16&\" \"&ROUND(cal!X40,1)&IF(UnitsNo=1,\" cm\",IF(UnitsNo=2,\" in\"))& \" \"&$T$17&\" \"&ROUND(cal!Z40,1)&IF(UnitsNo=1,\" cm\",IF(UnitsNo=2,\" in\"))&\" \"&$T$18&\" \"&ROUND(cal!AB40,1)&IF(UnitsNo=1,\" cm\",IF(UnitsNo=2,\" in\"))&\" (Type 4)\"","v":"Briza 12 høyde 41 cm bredde 14 cm lengde 145 cm (Type 4)"}]
[]
[]
[]
[]
[]
[null,"**Sound power according to ISO 3741:2010",{"$nulls":11},{"$f":"cal!P40","v":"v2021-04-26"}]
[null,"***Sound pressure with an assumed room damping of 8dB(A)"]

{"sheet":"SP","index":7,"n_rows":41,"n_cols":20,"rows_kept":41,"hidden":true,"merged":[[3,7,3,10],[4,7,4,10],[8,1,8,3],[8,6,8,9],[8,12,8,13],[9,1,9,3],[9,6,9,9],[10,1,10,3],[10,6,10,9],[11,6,11,9],[15,1,15,13],[21,1,21,13],[27,1,27,13],[33,1,33,13]]}
[]
[]
[]
[]
[]
[]
[null,"Temperaturas",{"$nulls":14},"Copiar todos los datos"]
[null,"Calefacción:",{"$nulls":4},"Enfriamiento:",{"$nulls":9},"Unidades-SI"]
[null,"Agua impulsión",0,0,{"$f":"cal!E9","v":75},null,{"$f":"B9","v":"Agua impulsión"},{"$nulls":3},{"$f":"cal!K9","v":8},null,"Convers. de unidades",{"$nulls":3},"Unidades-Imperial"]
[null,"Agua retorno",0,0,{"$f":"cal!E10","v":65},null,{"$f":"B10","v":"Agua retorno"},{"$nulls":3},{"$f":"cal!K10","v":14}]
[null,"Ambiente",0,0,{"$f":"cal!E11","v":20},null,{"$f":"B11","v":"Ambiente"},{"$nulls":3},{"$f":"cal!K11","v":25}]
[{"$nulls":6},"Humedad relativa",{"$nulls":3},{"$f":"cal!K12","v":{"v":0.5,"d":"50%"}}]
[]
[]
[null,"Nivel de velocidad"," Voltaje control [V]",{"$f":"CONCATENATE(\"Emisión calefacción \",ROUND(E9,0),\"/\",ROUND(E10,0),\"/\",ROUND(E11,0),\" [\"&IF(UnitsNo=1,\"W\",IF(UnitsNo=2,\"Btu/h\"))&\"]\")","v":"Emisión calefacción 75/65/20 [W]"},{"$f":"\"Caudal de agua, calefacción [\"&IF(1=1,\"l/h\",IF(UnitsNo=2,\"GPM\"))&\"]\"","v":"Caudal de agua, calefacción [l/h]"},{"$f":"\"Pérdida de carga del agua [\"&IF(UnitsNo=1,\"kPa\",IF(UnitsNo=2,\"ftH2O\"))&\"]\"","v":"Pérdida de carga del agua [kPa]"},{"$f":"CONCATENATE(\"Emisión sensible Frío * \",ROUND(K9,0),\"/\",ROUND(K10,0),\"/\",ROUND(K11,0),\" [\"&IF(UnitsNo=1,\"W\",IF(UnitsNo=2,\"Btu/h\"))&\"]\")","v":"Emisión sensible Frío * 8/14/25 [W]"},{"$f":"CONCATENATE(\"Emisión total Frío \",ROUND(K9,0),\"/\",ROUND(K10,0),\"/\",ROUND(K11,0),\" [\"&IF(UnitsNo=1,\"W\",IF(UnitsNo=2,\"Btu/h\"))&\"]\")","v":"Emisión total Frío 8/14/25 [W]"},{"$f":"\"Caudal de agua, Frío [\"&IF(UnitsNo=1,\"l/h\",IF(UnitsNo=2,\"GPM\"))&\"]\"","v":"Caudal de agua, Frío [l/h]"},{"$f":"F15","v":"Pérdida de carga del agua [kPa]"},"Presión sonora ** [dB(A)]","Potencia sonora * [dB(A)]","Potencia eléctrica absorbida [W]",{"$f":"\"Caudal de aire [\"&IF(UnitsNo=1,\"m³/h\",IF(UnitsNo=2,\"CFM\"))&\"]\"","v":"Caudal de aire [m³/h]"},{"$f":"\"Temperatura salida de aire calefacción [\"&IF(UnitsNo=1,\"°C\",IF(UnitsNo=2,\"°F\"))&\"]\"","v":"Temperatura salida de aire calefacción [°C]"},{"$f":"\"Temperatura salida de aire refrigeración (bulbo seco) [\"&IF(UnitsNo=1,\"°C\",IF(UnitsNo=2,\"°F\"))&\"]\"","v":"Temperatura salida de aire refrigeración (bulbo seco) [°C]"}]
[null,{"$f":"cal!$X$1&\" \"&$T$16&\" \"&ROUND(cal!X22,1)&IF(UnitsNo=1,\" cm\",IF(UnitsNo=2,\" in\"))& \" \"&$T$17&\" \"&ROUND(cal!Z22,1)&IF(UnitsNo=1,\" cm\",IF(UnitsNo=2,\" in\"))&\" \"&$T$18&\" \"&ROUND(cal!AB22,1)&IF(UnitsNo=1,\" cm\",IF(UnitsNo=2,\" in\"))&\" (Type 1)\"","v":"Briza 12 altura 41 cm ancho 14 cm longitud 75 cm (Type 1)"},{"$nulls":15},"Temp.",null,"altura"]
[{"$nulls":17},"calefac.",null,"ancho"]
[{"$nulls":17},"enfria.",null,"longitud"]
[]
[]
[]
[null,{"$f":"cal!$X$1&\" \"&$T$16&\" \"&ROUND(cal!X28,1)&IF(UnitsNo=1,\" cm\",IF(UnitsNo=2,\" in\"))& \" \"&$T$17&\" \"&ROUND(cal!Z28,1)&IF(UnitsNo=1,\" cm\",IF(UnitsNo=2,\" in\"))&\" \"&$T$18&\" \"&ROUND(cal!AB28,1)&IF(UnitsNo=1,\" cm\",IF(UnitsNo=2,\" in\"))&\" (Type 2)\"","v":"Briza 12 altura 41 cm ancho 14 cm longitud 95 cm (Type 2)"}]
[]
[]
[]
[]
[]
[null,{"$f":"cal!$X$1&\" \"&$T$16&\" \"&ROUND(cal!X34,1)&IF(UnitsNo=1,\" cm\",IF(UnitsNo=2,\" in\"))& \" \"&$T$17&\" \"&ROUND(cal!Z34,1)&IF(UnitsNo=1,\" cm\",IF(UnitsNo=2,\" in\"))&\" \"&$T$18&\" \"&ROUND(cal!AB34,1)&IF(UnitsNo=1,\" cm\",IF(UnitsNo=2,\" in\"))&\" (Type 3)\"","v":"Briza 12 altura 41 cm ancho 14 cm longitud 125 cm (Type 3)"}]
[]
[]
[]
[]
[]
[null,{"$f":"cal!$X$1&\" \"&$T$16&\" \"&ROUND(cal!X40,1)&IF(UnitsNo=1,\" cm\",IF(UnitsNo=2,\" in\"))& \" \"&$T$17&\" \"&ROUND(cal!Z40,1)&IF(UnitsNo=1,\" cm\",IF(UnitsNo=2,\" in\"))&\" \"&$T$18&\" \"&ROUND(cal!AB40,1)&IF(UnitsNo=1,\" cm\",IF(UnitsNo=2,\" in\"))&\" (Type 4)\"","v":"Briza 12 altura 41 cm ancho 14 cm longitud 145 cm (Type 4)"}]
[]
[]
[]
[]
[]
[null,"**Potencia sonora de acuerdo a ISO 3741:2010",{"$nulls":11},{"$f":"cal!P40","v":"v2021-04-26"}]
[null,"***Presión sonora asumiendo una reducción de la estancia de  8dB(A)"]

{"sheet":"SW","index":8,"n_rows":41,"n_cols":20,"rows_kept":41,"hidden":true,"merged":[[3,7,3,10],[4,7,4,10],[8,1,8,3],[8,6,8,9],[8,12,8,13],[9,1,9,3],[9,6,9,9],[10,6,10,9],[15,1,15,13],[21,1,21,13],[27,1,27,13],[33,1,33,13]]}
[]
[]
[null,"Formulary"]
[{"$nulls":7},"Hydraulic mix:",0,0,0]
[null,"Conditions",{"$nulls":5},"Device - Ventilator - Utilization:",0,0,0]
[]
[null,"Temperaturer",{"$nulls":14},"Kopiera all data"]
[null,"Värme:",{"$nulls":4},"Kyla:",{"$nulls":9},"SI-enheter"]
[null,"Tillopp",null,null,{"$f":"cal!E9","v":75},null,{"$f":"B9","v":"Tillopp"},{"$nulls":3},{"$f":"cal!K9","v":8},null,"Enhetssystem",{"$nulls":3},"Imperiella-enheter"]
[null,"Retur",null,null,{"$f":"cal!E10","v":65},null,{"$f":"B10","v":"Retur"},{"$nulls":3},{"$f":"cal!K10","v":14}]
[null,"Rum (torr)",null,null,{"$f":"cal!E11","v":20},null,{"$f":"B11","v":"Rum (torr)"},{"$nulls":3},{"$f":"cal!K11","v":25}]
[{"$nulls":6},"rel. Fuktighet",{"$nulls":3},{"$f":"cal!K12","v":{"v":0.5,"d":"50%"}}]
[]
[]
[null,"Fläkthastighet","Spänning, Fläkt [V]",{"$f":"CONCATENATE(\"Värme effekt  \",ROUND(E9,0),\"/\",ROUND(E10,0),\"/\",ROUND(E11,0),\" [\"&IF(cal!$W$4=1,\"W\",IF(cal!$W$4=2,\"Btu/h\"))&\"]\")","v":"Värme effekt  75/65/20 [W]"},{"$f":"\"Vattenflöde, värme [\"&IF(cal!$W$4=1,\"l/h\",IF(cal!$W$4=2,\"GPM\"))&\"]\"","v":"Vattenflöde, värme [l/h]"},{"$f":"\"Tryckfall, vatten [\"&IF(cal!$W$4=1,\"kPa\",IF(cal!$W$4=2,\"inH2O\"))&\"]\"","v":"Tryckfall, vatten [kPa]"},{"$f":"CONCATENATE(\"Märkbar kylkapacitet  \",ROUND(K9,0),\"/\",ROUND(K10,0),\"/\",ROUND(K11,0),\" [\"&IF(cal!$W$4=1,\"W\",IF(cal!$W$4=2,\"Btu/h\"))&\"]\")","v":"Märkbar kylkapacitet  8/14/25 [W]"},{"$f":"CONCATENATE(\"Total kylkapacitet \",ROUND(K9,0),\"/\",ROUND(K10,0),\"/\",ROUND(K11,0),\" [\"&IF(cal!$W$4=1,\"W\",IF(cal!$W$4=2,\"Btu/h\"))&\"]\")","v":"Total kylkapacitet 8/14/25 [W]"},{"$f":"\"Vattenflöde, kyla [\"&IF(cal!$W$4=1,\"l/h\",IF(cal!$W$4=2,\"GPM\"))&\"]\"","v":"Vattenflöde, kyla [l/h]"},{"$f":"F15","v":"Tryckfall, vatten [kPa]"},"Ljudtryck ** [dB(A)]","Ljudeffekt * [dB(A)]","Effektförbrukning [W]",{"$f":"\"Luftflöde [\"&IF(cal!$W$4=1,\"m³/h\",IF(cal!$W$4=2,\"CFM\"))&\"]\"","v":"Luftflöde [m³/h]"},{"$f":"\"Luftavgassystemets värming  [\"&IF(cal!$W$4=1,\"°C\",IF(cal!$W$4=2,\"°F\"))&\"]\"","v":"Luftavgassystemets värming  [°C]"},{"$f":"\"Luftavgassystemets kylning  [\"&IF(cal!$W$4=1,\"°C\",IF(cal!$W$4=2,\"°F\"))&\"]\"","v":"Luftavgassystemets kylning  [°C]"}]
[null,{"$f":"cal!$X$1&\" \"&$T$16&\" \"&ROUND(cal!X22,1)&IF(UnitsNo=1,\" cm\",IF(UnitsNo=2,\" in\"))& \" \"&$T$17&\" \"&ROUND(cal!Z22,1)&IF(UnitsNo=1,\" cm\",IF(UnitsNo=2,\" in\"))&\" \"&$T$18&\" \"&ROUND(cal!AB22,1)&IF(UnitsNo=1,\" cm\",IF(UnitsNo=2,\" in\"))&\" (Typ 1)\"","v":"Briza 12 höjd 41 cm djup 14 cm längd 75 cm (Typ 1)"},{"$nulls":15},"Temp.",null,"höjd"]
[{"$nulls":17},"värme!",null,"djup"]
[{"$nulls":17},"kyla!",null,"längd"]
[]
[]
[]
[null,{"$f":"cal!$X$1&\" \"&$T$16&\" \"&ROUND(cal!X28,1)&IF(UnitsNo=1,\" cm\",IF(UnitsNo=2,\" in\"))& \" \"&$T$17&\" \"&ROUND(cal!Z28,1)&IF(UnitsNo=1,\" cm\",IF(UnitsNo=2,\" in\"))&\" \"&$T$18&\" \"&ROUND(cal!AB28,1)&IF(UnitsNo=1,\" cm\",IF(UnitsNo=2,\" in\"))&\" (Typ 2)\"","v":"Briza 12 höjd 41 cm djup 14 cm längd 95 cm (Typ 2)"}]
[]
[]
[]
[]
[]
[null,{"$f":"cal!$X$1&\" \"&$T$16&\" \"&ROUND(cal!X34,1)&IF(UnitsNo=1,\" cm\",IF(UnitsNo=2,\" in\"))& \" \"&$T$17&\" \"&ROUND(cal!Z34,1)&IF(UnitsNo=1,\" cm\",IF(UnitsNo=2,\" in\"))&\" \"&$T$18&\" \"&ROUND(cal!AB34,1)&IF(UnitsNo=1,\" cm\",IF(UnitsNo=2,\" in\"))&\" (Typ 3)\"","v":"Briza 12 höjd 41 cm djup 14 cm längd 125 cm (Typ 3)"}]
[]
[]
[]
[]
[]
[null,{"$f":"cal!$X$1&\" \"&$T$16&\" \"&ROUND(cal!X40,1)&IF(UnitsNo=1,\" cm\",IF(UnitsNo=2,\" in\"))& \" \"&$T$17&\" \"&ROUND(cal!Z40,1)&IF(UnitsNo=1,\" cm\",IF(UnitsNo=2,\" in\"))&\" \"&$T$18&\" \"&ROUND(cal!AB40,1)&IF(UnitsNo=1,\" cm\",IF(UnitsNo=2,\" in\"))&\" (Typ 4)\"","v":"Briza 12 höjd 41 cm djup 14 cm längd 145 cm (Typ 4)"}]
[]
[]
[]
[]
[]
[null,"*Ljudeffekt enligt ISO 3741: 2010",{"$nulls":11},{"$f":"cal!P40","v":"v2021-04-26"}]
[null,"**Ljudtryck med en antagen rumsdämpning på 8dB (A)"]

{"sheet":"TS","index":9,"n_rows":41,"n_cols":20,"rows_kept":41,"hidden":true,"merged":[[3,7,3,10],[4,7,4,10],[8,1,8,3],[8,6,8,9],[8,12,8,13],[9,1,9,3],[9,6,9,9],[10,1,10,3],[10,6,10,9],[15,1,15,13],[21,1,21,13],[27,1,27,13],[33,1,33,13]]}
[]
[]
[null,"Invulformulier"]
[{"$nulls":7},"Směs vody:",0,0,0]
[null,"Randvoorwaarden",{"$nulls":5},"Těleso - Ventilátor - Verze:",0,0,0]
[]
[null,"Teploty",{"$nulls":14},"Kopírovat všechna data"]
[null,"Topení:",{"$nulls":4},"Chlazení:",{"$nulls":9},"Mezinárodní (Sl)"]
[null,{"$f":"\"Voda na přívodu\"","v":"Voda na přívodu"},null,null,{"$f":"cal!E9","v":75},null,{"$f":"B9","v":"Voda na přívodu"},{"$nulls":3},{"$f":"cal!K9","v":8},null,"Převod jednotek",{"$nulls":3},"Imperiální"]
[null,{"$f":"\"Voda na zpátečce\"","v":"Voda na zpátečce"},null,null,{"$f":"cal!E10","v":65},null,{"$f":"B10","v":"Voda na zpátečce"},{"$nulls":3},{"$f":"cal!K10","v":14}]
[null,"\"Suchá\" teplota vzduchu",null,null,{"$f":"cal!E11","v":20},null,{"$f":"B11","v":"\"Suchá\" teplota vzduchu"},{"$nulls":3},{"$f":"cal!K11","v":25}]
[{"$nulls":6},"Relativní vlhkost",{"$nulls":3},{"$f":"cal!K12","v":{"v":0.5,"d":"50%"}}]
[]
[]
[null,"Rychlost","Ovládací napětí [V]",{"$f":"CONCATENATE(\"Výkon Topení  \",ROUND(E9,0),\"/\",ROUND(E10,0),\"/\",ROUND(E11,0),\" [\"&IF(UnitsNo=1,\"W\",IF(UnitsNo=2,\"Btu/h\"))&\"]\")","v":"Výkon Topení  75/65/20 [W]"},{"$f":"\"Průtok vody, topení [\"&IF(UnitsNo=1,\"l/h\",IF(UnitsNo=2,\"GPM\"))&\"]\"","v":"Průtok vody, topení [l/h]"},{"$f":"\"Tlaková ztráta [\"&IF(UnitsNo=1,\"kPa\",IF(UnitsNo=2,\"inH2O\"))&\"]\"","v":"Tlaková ztráta [kPa]"},{"$f":"CONCATENATE(\"Výkon chlazení Znatelný  \",ROUND(K9,0),\"/\",,ROUND(K10,0),\"/\",,ROUND(K11,0),\" [\"&IF(UnitsNo=1,\"W\",IF(UnitsNo=2,\"Btu/h\"))&\"]\")","v":"Výkon chlazení Znatelný  8/14/25 [W]"},{"$f":"CONCATENATE(\"Výkon chlazení Celkový \",,ROUND(K9,0),\"/\",,ROUND(K10,0),\"/\",,ROUND(K11,0),\" [\"&IF(UnitsNo=1,\"W\",IF(UnitsNo=2,\"Btu/h\"))&\"]\")","v":"Výkon chlazení Celkový 8/14/25 [W]"},{"$f":"\"Průtok vody, chlazení [\"&IF(UnitsNo=1,\"l/h\",IF(UnitsNo=2,\"GPM\"))&\"]\"","v":"Průtok vody, chlazení [l/h]"},{"$f":"F15","v":"Tlaková ztráta [kPa]"},"Akustický tlak ** [dB(A)]","Akustický výkon * [dB(A)]","Elektrický výkon [W]",{"$f":"\"Průtok vzduchu [\"&IF(UnitsNo=1,\"m³/h\",IF(UnitsNo=2,\"CFM\"))&\"]\"","v":"Průtok vzduchu [m³/h]"},{"$f":"\"Výfuková teplota vzduchu top. [\"&IF(UnitsNo=1,\"°C\",IF(UnitsNo=2,\"°F\"))&\"]\"","v":"Výfuková teplota vzduchu top. [°C]"},{"$f":"\"Výfuková teplota vzduchu chlaz.  [\"&IF(UnitsNo=1,\"°C\",IF(UnitsNo=2,\"°F\"))&\"]\"","v":"Výfuková teplota vzduchu chlaz.  [°C]"}]
[null,{"$f":"cal!$X$1&\" \"&$T$16&\", \"&ROUND(cal!X22,1)&IF(UnitsNo=1,\" cm\",IF(UnitsNo=2,\" in\"))& \", \"&$T$17&\" \"&ROUND(cal!Z22,1)&IF(UnitsNo=1,\" cm\",IF(UnitsNo=2,\" in\"))&\", \"&$T$18&\" \"&ROUND(cal!AB22,1)&IF(UnitsNo=1,\" cm\",IF(UnitsNo=2,\" in\"))&\" (Typ 1)\"","v":"Briza 12 Výška, 41 cm, Šířka 14 cm, Délka 75 cm (Typ 1)"},{"$nulls":15},"Teploty",null,"Výška"]
[{"$nulls":17},"topení!",null,"Šířka"]
[{"$nulls":17},"chlazení!",null,"Délka"]
[]
[]
[]
[null,{"$f":"cal!$X$1&\" \"&$T$16&\" \"&ROUND(cal!X28,1)&IF(UnitsNo=1,\" cm\",IF(UnitsNo=2,\" in\"))& \" \"&$T$17&\" \"&ROUND(cal!Z28,1)&IF(UnitsNo=1,\" cm\",IF(UnitsNo=2,\" in\"))&\" \"&$T$18&\" \"&ROUND(cal!AB28,1)&IF(UnitsNo=1,\" cm\",IF(UnitsNo=2,\" in\"))&\" (Typ 2)\"","v":"Briza 12 Výška 41 cm Šířka 14 cm Délka 95 cm (Typ 2)"}]
[]
[]
[]
[]
[]
[null,{"$f":"cal!$X$1&\" \"&$T$16&\" \"&ROUND(cal!X34,1)&IF(UnitsNo=1,\" cm\",IF(UnitsNo=2,\" in\"))& \" \"&$T$17&\" \"&ROUND(cal!Z34,1)&IF(UnitsNo=1,\" cm\",IF(UnitsNo=2,\" in\"))&\" \"&$T$18&\" \"&ROUND(cal!AB34,1)&IF(UnitsNo=1,\" cm\",IF(UnitsNo=2,\" in\"))&\" (Typ 3)\"","v":"Briza 12 Výška 41 cm Šířka 14 cm Délka 125 cm (Typ 3)"}]
[]
[]
[]
[]
[]
[null,{"$f":"cal!$X$1&\" \"&$T$16&\" \"&ROUND(cal!X40,1)&IF(UnitsNo=1,\" cm\",IF(UnitsNo=2,\" in\"))& \" \"&$T$17&\" \"&ROUND(cal!Z40,1)&IF(UnitsNo=1,\" cm\",IF(UnitsNo=2,\" in\"))&\" \"&$T$18&\" \"&ROUND(cal!AB40,1)&IF(UnitsNo=1,\" cm\",IF(UnitsNo=2,\" in\"))&\" (Typ 4)\"","v":"Briza 12 Výška 41 cm Šířka 14 cm Délka 145 cm (Typ 4)"}]
[]
[]
[]
[]
[]
[null,"*Akustický tlak podle ISO 3741:2010 ",{"$nulls":11},{"$f":"cal!P40","v":"v2021-04-26"}]
[null,"**Akustický výkon s předpokládaným útlumem místnosti 8 dB (A)."]

{"sheet":"ExtraTaal1","index":10,"n_rows":41,"n_cols":20,"rows_kept":41,"hidden":true,"merged":[[3,7,3,10],[4,7,4,10],[8,1,8,3],[8,6,8,9],[8,12,8,13],[9,1,9,3],[9,6,9,9],[10,6,10,9],[15,1,15,13],[21,1,21,13],[27,1,27,13],[33,1,33,13]]}
[]
[]
[null,"Formulary"]
[{"$nulls":7},"Hydraulic mix:",0,0,0]
[null,"Conditions",{"$nulls":5},"Device - Ventilator - Utilization:",0,0,0]
[]
[null,"Temperatures",{"$nulls":14},"Copy all data"]
[null,"Heating:",{"$nulls":4},"Cooling:",{"$nulls":9},"SI-units"]
[null,"Supply water",null,null,{"$f":"cal!E9","v":75},null,{"$f":"B9","v":"Supply water"},{"$nulls":3},{"$f":"cal!K9","v":8},null,"Unit conversion",{"$nulls":3},"Imperial-units"]
[null,"Return water",null,null,{"$f":"cal!E10","v":65},null,{"$f":"B10","v":"Return water"},{"$nulls":3},{"$f":"cal!K10","v":14}]
[null,"Entering air",null,null,{"$f":"cal!E11","v":20},null,{"$f":"B11","v":"Entering air"},{"$nulls":3},{"$f":"cal!K11","v":25}]
[{"$nulls":6},"Relative humidity",{"$nulls":3},{"$f":"cal!K12","v":{"v":0.5,"d":"50%"}}]
[]
[]
[null,"Speed level","Control voltage [V]",{"$f":"CONCATENATE(\"Heat output  \",ROUND(E9,0),\"/\",ROUND(E10,0),\"/\",ROUND(E11,0),\" [\"&IF(cal!$W$4=1,\"W\",IF(cal!$W$4=2,\"Btu/h\"))&\"]\")","v":"Heat output  75/65/20 [W]"},{"$f":"\"Water flowrate, heating [\"&IF(cal!$W$4=1,\"l/h\",IF(cal!$W$4=2,\"GPM\"))&\"]\"","v":"Water flowrate, heating [l/h]"},{"$f":"\"Watersided pressure loss [\"&IF(cal!$W$4=1,\"kPa\",IF(cal!$W$4=2,\"inH2O\"))&\"]\"","v":"Watersided pressure loss [kPa]"},{"$f":"CONCATENATE(\"Sens. cooling capacity  \",ROUND(K9,0),\"/\",ROUND(K10,0),\"/\",ROUND(K11,0),\" [\"&IF(cal!$W$4=1,\"W\",IF(cal!$W$4=2,\"Btu/h\"))&\"]\")","v":"Sens. cooling capacity  8/14/25 [W]"},{"$f":"CONCATENATE(\"Tot. cooling capacity \",ROUND(K9,0),\"/\",ROUND(K10,0),\"/\",ROUND(K11,0),\" [\"&IF(cal!$W$4=1,\"W\",IF(cal!$W$4=2,\"Btu/h\"))&\"]\")","v":"Tot. cooling capacity 8/14/25 [W]"},{"$f":"\"Water flowrate, cooling [\"&IF(cal!$W$4=1,\"l/h\",IF(cal!$W$4=2,\"GPM\"))&\"]\"","v":"Water flowrate, cooling [l/h]"},{"$f":"\"Watersided pressure loss [\"&IF(cal!$W$4=1,\"kPa\",IF(cal!$W$4=2,\"inH2O\"))&\"]\"","v":"Watersided pressure loss [kPa]"},"Sound pressure ** [dB(A)]","Sound power * [dB(A)]","Electrical power [W]",{"$f":"\"Air flowrate [\"&IF(cal!$W$4=1,\"m³/h\",IF(cal!$W$4=2,\"CFM\"))&\"]\"","v":"Air flowrate [m³/h]"},{"$f":"\"Air exhaust temp. heating  [\"&IF(cal!$W$4=1,\"°C\",IF(cal!$W$4=2,\"°F\"))&\"]\"","v":"Air exhaust temp. heating  [°C]"},{"$f":"\"Air exhaust temp. cooling  [\"&IF(cal!$W$4=1,\"°C\",IF(cal!$W$4=2,\"°F\"))&\"]\"","v":"Air exhaust temp. cooling  [°C]"}]
[null,{"$f":"cal!$X$1&\" \"&$T$16&\" \"&ROUND(cal!X22,1)&IF(UnitsNo=1,\" cm\",IF(UnitsNo=2,\" in\"))& \" \"&$T$17&\" \"&ROUND(cal!Z22,1)&IF(UnitsNo=1,\" cm\",IF(UnitsNo=2,\" in\"))&\" \"&$T$18&\" \"&ROUND(cal!AB22,1)&IF(UnitsNo=1,\" cm\",IF(UnitsNo=2,\" in\"))&\" (Type 1)\"","v":"Briza 12 height 41 cm width 14 cm length 75 cm (Type 1)"},{"$nulls":15},"Temp.",null,"height"]
[{"$nulls":17},"heating!",null,"width"]
[{"$nulls":17},"cooling!",null,"length"]
[]
[]
[]
[null,{"$f":"cal!$X$1&\" \"&$T$16&\" \"&ROUND(cal!X28,1)&IF(UnitsNo=1,\" cm\",IF(UnitsNo=2,\" in\"))& \" \"&$T$17&\" \"&ROUND(cal!Z28,1)&IF(UnitsNo=1,\" cm\",IF(UnitsNo=2,\" in\"))&\" \"&$T$18&\" \"&ROUND(cal!AB28,1)&IF(UnitsNo=1,\" cm\",IF(UnitsNo=2,\" in\"))&\" (Type 2)\"","v":"Briza 12 height 41 cm width 14 cm length 95 cm (Type 2)"}]
[]
[]
[]
[]
[]
[null,{"$f":"cal!$X$1&\" \"&$T$16&\" \"&ROUND(cal!X34,1)&IF(UnitsNo=1,\" cm\",IF(UnitsNo=2,\" in\"))& \" \"&$T$17&\" \"&ROUND(cal!Z34,1)&IF(UnitsNo=1,\" cm\",IF(UnitsNo=2,\" in\"))&\" \"&$T$18&\" \"&ROUND(cal!AB34,1)&IF(UnitsNo=1,\" cm\",IF(UnitsNo=2,\" in\"))&\" (Type 3)\"","v":"Briza 12 height 41 cm width 14 cm length 125 cm (Type 3)"}]
[]
[]
[]
[]
[]
[null,{"$f":"cal!$X$1&\" \"&$T$16&\" \"&ROUND(cal!X40,1)&IF(UnitsNo=1,\" cm\",IF(UnitsNo=2,\" in\"))& \" \"&$T$17&\" \"&ROUND(cal!Z40,1)&IF(UnitsNo=1,\" cm\",IF(UnitsNo=2,\" in\"))&\" \"&$T$18&\" \"&ROUND(cal!AB40,1)&IF(UnitsNo=1,\" cm\",IF(UnitsNo=2,\" in\"))&\" (Type 4)\"","v":"Briza 12 height 41 cm width 14 cm length 145 cm (Type 4)"}]
[]
[]
[]
[]
[]
[null,"*Sound power according to ISO 3741:2010",{"$nulls":11},{"$f":"cal!P40","v":"v2021-04-26"}]
[null,"**Sound pressure with an assumed room damping of 8dB(A)"]

{"sheet":"ExtraTaal2","index":11,"n_rows":41,"n_cols":20,"rows_kept":41,"hidden":true,"merged":[[3,7,3,10],[4,7,4,10],[8,1,8,3],[8,6,8,9],[8,12,8,13],[9,1,9,3],[9,6,9,9],[10,6,10,9],[15,1,15,13],[21,1,21,13],[27,1,27,13],[33,1,33,13]]}
[]
[]
[null,"Formulary"]
[{"$nulls":7},"Hydraulic mix:",0,0,0]
[null,"Conditions",{"$nulls":5},"Device - Ventilator - Utilization:",0,0,0]
[]
[null,"Temperatures",{"$nulls":14},"Copy all data"]
[null,"Heating:",{"$nulls":4},"Cooling:",{"$nulls":9},"SI-units"]
[null,"Supply water",null,null,{"$f":"cal!E9","v":75},null,{"$f":"B9","v":"Supply water"},{"$nulls":3},{"$f":"cal!K9","v":8},null,"Unit conversion",{"$nulls":3},"Imperial-units"]
[null,"Return water",null,null,{"$f":"cal!E10","v":65},null,{"$f":"B10","v":"Return water"},{"$nulls":3},{"$f":"cal!K10","v":14}]
[null,"Entering air",null,null,{"$f":"cal!E11","v":20},null,{"$f":"B11","v":"Entering air"},{"$nulls":3},{"$f":"cal!K11","v":25}]
[{"$nulls":6},"Relative humidity",{"$nulls":3},{"$f":"cal!K12","v":{"v":0.5,"d":"50%"}}]
[]
[]
[null,"Speed level","Control voltage [V]",{"$f":"CONCATENATE(\"Heat output  \",ROUND(E9,0),\"/\",ROUND(E10,0),\"/\",ROUND(E11,0),\" [\"&IF(cal!$W$4=1,\"W\",IF(cal!$W$4=2,\"Btu/h\"))&\"]\")","v":"Heat output  75/65/20 [W]"},{"$f":"\"Water flowrate, heating [\"&IF(cal!$W$4=1,\"l/h\",IF(cal!$W$4=2,\"GPM\"))&\"]\"","v":"Water flowrate, heating [l/h]"},{"$f":"\"Watersided pressure loss [\"&IF(cal!$W$4=1,\"kPa\",IF(cal!$W$4=2,\"inH2O\"))&\"]\"","v":"Watersided pressure loss [kPa]"},{"$f":"CONCATENATE(\"Sens. cooling capacity  \",ROUND(K9,0),\"/\",ROUND(K10,0),\"/\",ROUND(K11,0),\" [\"&IF(cal!$W$4=1,\"W\",IF(cal!$W$4=2,\"Btu/h\"))&\"]\")","v":"Sens. cooling capacity  8/14/25 [W]"},{"$f":"CONCATENATE(\"Tot. cooling capacity \",ROUND(K9,0),\"/\",ROUND(K10,0),\"/\",ROUND(K11,0),\" [\"&IF(cal!$W$4=1,\"W\",IF(cal!$W$4=2,\"Btu/h\"))&\"]\")","v":"Tot. cooling capacity 8/14/25 [W]"},{"$f":"\"Water flowrate, cooling [\"&IF(cal!$W$4=1,\"l/h\",IF(cal!$W$4=2,\"GPM\"))&\"]\"","v":"Water flowrate, cooling [l/h]"},{"$f":"\"Watersided pressure loss [\"&IF(cal!$W$4=1,\"kPa\",IF(cal!$W$4=2,\"inH2O\"))&\"]\"","v":"Watersided pressure loss [kPa]"},"Sound pressure ** [dB(A)]","Sound power * [dB(A)]","Electrical power [W]",{"$f":"\"Air flowrate [\"&IF(cal!$W$4=1,\"m³/h\",IF(cal!$W$4=2,\"CFM\"))&\"]\"","v":"Air flowrate [m³/h]"},{"$f":"\"Air exhaust temp. heating  [\"&IF(cal!$W$4=1,\"°C\",IF(cal!$W$4=2,\"°F\"))&\"]\"","v":"Air exhaust temp. heating  [°C]"},{"$f":"\"Air exhaust temp. cooling  [\"&IF(cal!$W$4=1,\"°C\",IF(cal!$W$4=2,\"°F\"))&\"]\"","v":"Air exhaust temp. cooling  [°C]"}]
[null,{"$f":"cal!$X$1&\" \"&$T$16&\" \"&ROUND(cal!X22,1)&IF(UnitsNo=1,\" cm\",IF(UnitsNo=2,\" in\"))& \" \"&$T$17&\" \"&ROUND(cal!Z22,1)&IF(UnitsNo=1,\" cm\",IF(UnitsNo=2,\" in\"))&\" \"&$T$18&\" \"&ROUND(cal!AB22,1)&IF(UnitsNo=1,\" cm\",IF(UnitsNo=2,\" in\"))&\" (Type 1)\"","v":"Briza 12 height 41 cm width 14 cm length 75 cm (Type 1)"},{"$nulls":15},"Temp.",null,"height"]
[{"$nulls":17},"heating!",null,"width"]
[{"$nulls":17},"cooling!",null,"length"]
[]
[]
[]
[null,{"$f":"cal!$X$1&\" \"&$T$16&\" \"&ROUND(cal!X28,1)&IF(UnitsNo=1,\" cm\",IF(UnitsNo=2,\" in\"))& \" \"&$T$17&\" \"&ROUND(cal!Z28,1)&IF(UnitsNo=1,\" cm\",IF(UnitsNo=2,\" in\"))&\" \"&$T$18&\" \"&ROUND(cal!AB28,1)&IF(UnitsNo=1,\" cm\",IF(UnitsNo=2,\" in\"))&\" (Type 2)\"","v":"Briza 12 height 41 cm width 14 cm length 95 cm (Type 2)"}]
[]
[]
[]
[]
[]
[null,{"$f":"cal!$X$1&\" \"&$T$16&\" \"&ROUND(cal!X34,1)&IF(UnitsNo=1,\" cm\",IF(UnitsNo=2,\" in\"))& \" \"&$T$17&\" \"&ROUND(cal!Z34,1)&IF(UnitsNo=1,\" cm\",IF(UnitsNo=2,\" in\"))&\" \"&$T$18&\" \"&ROUND(cal!AB34,1)&IF(UnitsNo=1,\" cm\",IF(UnitsNo=2,\" in\"))&\" (Type 3)\"","v":"Briza 12 height 41 cm width 14 cm length 125 cm (Type 3)"}]
[]
[]
[]
[]
[]
[null,{"$f":"cal!$X$1&\" \"&$T$16&\" \"&ROUND(cal!X40,1)&IF(UnitsNo=1,\" cm\",IF(UnitsNo=2,\" in\"))& \" \"&$T$17&\" \"&ROUND(cal!Z40,1)&IF(UnitsNo=1,\" cm\",IF(UnitsNo=2,\" in\"))&\" \"&$T$18&\" \"&ROUND(cal!AB40,1)&IF(UnitsNo=1,\" cm\",IF(UnitsNo=2,\" in\"))&\" (Type 4)\"","v":"Briza 12 height 41 cm width 14 cm length 145 cm (Type 4)"}]
[]
[]
[]
[]
[]
[null,"*Sound power according to ISO 3741:2010",{"$nulls":11},{"$f":"cal!P40","v":"v2021-04-26"}]
[null,"**Sound pressure with an assumed room damping of 8dB(A)"]

{"sheet":"ExtraTaal3","index":12,"n_rows":41,"n_cols":20,"rows_kept":41,"hidden":true,"merged":[[3,7,3,10],[4,7,4,10],[8,1,8,3],[8,6,8,9],[8,12,8,13],[9,1,9,3],[9,6,9,9],[10,6,10,9],[15,1,15,13],[21,1,21,13],[27,1,27,13],[33,1,33,13]]}
[]
[]
[null,"Formulary"]
[{"$nulls":7},"Hydraulic mix:",0,0,0]
[null,"Conditions",{"$nulls":5},"Device - Ventilator - Utilization:",0,0,0]
[]
[null,"Temperatures",{"$nulls":14},"Copy all data"]
[null,"Heating:",{"$nulls":4},"Cooling:",{"$nulls":9},"SI-units"]
[null,"Supply water",null,null,{"$f":"cal!E9","v":75},null,{"$f":"B9","v":"Supply water"},{"$nulls":3},{"$f":"cal!K9","v":8},null,"Unit conversion",{"$nulls":3},"Imperial-units"]
[null,"Return water",null,null,{"$f":"cal!E10","v":65},null,{"$f":"B10","v":"Return water"},{"$nulls":3},{"$f":"cal!K10","v":14}]
[null,"Entering air",null,null,{"$f":"cal!E11","v":20},null,{"$f":"B11","v":"Entering air"},{"$nulls":3},{"$f":"cal!K11","v":25}]
[{"$nulls":6},"Relative humidity",{"$nulls":3},{"$f":"cal!K12","v":{"v":0.5,"d":"50%"}}]
[]
[]
[null,"Speed level","Control voltage [V]",{"$f":"CONCATENATE(\"Heat output  \",ROUND(E9,0),\"/\",ROUND(E10,0),\"/\",ROUND(E11,0),\" [\"&IF(cal!$W$4=1,\"W\",IF(cal!$W$4=2,\"Btu/h\"))&\"]\")","v":"Heat output  75/65/20 [W]"},{"$f":"\"Water flowrate, heating [\"&IF(cal!$W$4=1,\"l/h\",IF(cal!$W$4=2,\"GPM\"))&\"]\"","v":"Water flowrate, heating [l/h]"},{"$f":"\"Watersided pressure loss [\"&IF(cal!$W$4=1,\"kPa\",IF(cal!$W$4=2,\"inH2O\"))&\"]\"","v":"Watersided pressure loss [kPa]"},{"$f":"CONCATENATE(\"Sens. cooling capacity  \",ROUND(K9,0),\"/\",ROUND(K10,0),\"/\",ROUND(K11,0),\" [\"&IF(cal!$W$4=1,\"W\",IF(cal!$W$4=2,\"Btu/h\"))&\"]\")","v":"Sens. cooling capacity  8/14/25 [W]"},{"$f":"CONCATENATE(\"Tot. cooling capacity \",ROUND(K9,0),\"/\",ROUND(K10,0),\"/\",ROUND(K11,0),\" [\"&IF(cal!$W$4=1,\"W\",IF(cal!$W$4=2,\"Btu/h\"))&\"]\")","v":"Tot. cooling capacity 8/14/25 [W]"},{"$f":"\"Water flowrate, cooling [\"&IF(cal!$W$4=1,\"l/h\",IF(cal!$W$4=2,\"GPM\"))&\"]\"","v":"Water flowrate, cooling [l/h]"},{"$f":"\"Watersided pressure loss [\"&IF(cal!$W$4=1,\"kPa\",IF(cal!$W$4=2,\"inH2O\"))&\"]\"","v":"Watersided pressure loss [kPa]"},"Sound pressure ** [dB(A)]","Sound power * [dB(A)]","Electrical power [W]",{"$f":"\"Air flowrate [\"&IF(cal!$W$4=1,\"m³/h\",IF(cal!$W$4=2,\"CFM\"))&\"]\"","v":"Air flowrate [m³/h]"},{"$f":"\"Air exhaust temp. heating  [\"&IF(cal!$W$4=1,\"°C\",IF(cal!$W$4=2,\"°F\"))&\"]\"","v":"Air exhaust temp. heating  [°C]"},{"$f":"\"Air exhaust temp. cooling  [\"&IF(cal!$W$4=1,\"°C\",IF(cal!$W$4=2,\"°F\"))&\"]\"","v":"Air exhaust temp. cooling  [°C]"}]
[null,{"$f":"cal!$X$1&\" \"&$T$16&\" \"&ROUND(cal!X22,1)&IF(UnitsNo=1,\" cm\",IF(UnitsNo=2,\" in\"))& \" \"&$T$17&\" \"&ROUND(cal!Z22,1)&IF(UnitsNo=1,\" cm\",IF(UnitsNo=2,\" in\"))&\" \"&$T$18&\" \"&ROUND(cal!AB22,1)&IF(UnitsNo=1,\" cm\",IF(UnitsNo=2,\" in\"))&\" (Type 1)\"","v":"Briza 12 height 41 cm width 14 cm length 75 cm (Type 1)"},{"$nulls":15},"Temp.",null,"height"]
[{"$nulls":17},"heating!",null,"width"]
[{"$nulls":17},"cooling!",null,"length"]
[]
[]
[]
[null,{"$f":"cal!$X$1&\" \"&$T$16&\" \"&ROUND(cal!X28,1)&IF(UnitsNo=1,\" cm\",IF(UnitsNo=2,\" in\"))& \" \"&$T$17&\" \"&ROUND(cal!Z28,1)&IF(UnitsNo=1,\" cm\",IF(UnitsNo=2,\" in\"))&\" \"&$T$18&\" \"&ROUND(cal!AB28,1)&IF(UnitsNo=1,\" cm\",IF(UnitsNo=2,\" in\"))&\" (Type 2)\"","v":"Briza 12 height 41 cm width 14 cm length 95 cm (Type 2)"}]
[]
[]
[]
[]
[]
[null,{"$f":"cal!$X$1&\" \"&$T$16&\" \"&ROUND(cal!X34,1)&IF(UnitsNo=1,\" cm\",IF(UnitsNo=2,\" in\"))& \" \"&$T$17&\" \"&ROUND(cal!Z34,1)&IF(UnitsNo=1,\" cm\",IF(UnitsNo=2,\" in\"))&\" \"&$T$18&\" \"&ROUND(cal!AB34,1)&IF(UnitsNo=1,\" cm\",IF(UnitsNo=2,\" in\"))&\" (Type 3)\"","v":"Briza 12 height 41 cm width 14 cm length 125 cm (Type 3)"}]
[]
[]
[]
[]
[]
[null,{"$f":"cal!$X$1&\" \"&$T$16&\" \"&ROUND(cal!X40,1)&IF(UnitsNo=1,\" cm\",IF(UnitsNo=2,\" in\"))& \" \"&$T$17&\" \"&ROUND(cal!Z40,1)&IF(UnitsNo=1,\" cm\",IF(UnitsNo=2,\" in\"))&\" \"&$T$18&\" \"&ROUND(cal!AB40,1)&IF(UnitsNo=1,\" cm\",IF(UnitsNo=2,\" in\"))&\" (Type 4)\"","v":"Briza 12 height 41 cm width 14 cm length 145 cm (Type 4)"}]
[]
[]
[]
[]
[]
[null,"*Sound power according to ISO 3741:2010",{"$nulls":11},{"$f":"cal!P40","v":"v2021-04-26"}]
[null,"**Sound pressure with an assumed room damping of 8dB(A)"]